program: Gaussian 09
title: 000241609
version: EM64L-G09RevD.01
frameworkgroup: C1[X(C9H10ClNO3)]
method: RPBEPBE
basis: SDD
operation: Freq
keyword: #p
keyword: freq=noraman
keyword: PBEPBE/SDD
title: #p freq=noraman PBEPBE/SDD
converged: NO YES NO YES
title: Mulliken charges:
elementType: Cl O O O N C C C C C C C C C H H H H H H H H H H
charge: -0.021626 -0.305793 -0.242096 -0.234889 -0.392210 0.376537 0.184452 -0.498075 0.461128 -0.268011 -0.360637 -0.528310 -0.536234 -0.089789 0.250805 0.270530 0.362392 0.249136 0.228752 0.228750 0.223126 0.253901 0.223125 0.165037
chargesum: 0.00000
title: Mulliken charges with hydrogens summed into heavy atoms:
elementType: Cl O O O N C C C C C C C C C
charge: -0.021626 -0.305793 -0.242096 -0.234889 -0.029818 0.376537 0.184452 -0.247270 0.461128 0.002519 -0.360637 0.178328 0.163917 0.075248
polarizability: 1.95814437e+02 -7.49230016e+00 1.54416072e+02 -2.71672894e-03 8.38774780e-03 5.90539751e+01
1716.lowfreq: -3.5906 0.0024 0.0029 0.0029 2.2838 8.8643 35.2167 64.6524 98.4632
frequency: 35.2074 64.6520 98.4631 101.2697 114.9257 146.3272 167.1061 175.2862 179.0115 218.2436 250.8084 269.4701 295.0400 311.5769 358.7147 395.3976 416.5840 446.5288 469.2145 520.9554 622.1731 658.0988 664.4776 709.1607 718.7314 803.1272 822.3143 841.2670 843.9690 950.9276 971.5955 1000.2567 1033.0210 1111.0676 1117.4022 1128.4606 1157.6338 1162.7543 1190.7785 1224.2124 1264.2221 1312.6958 1370.5494 1379.0464 1397.8338 1436.0481 1447.0585 1448.1432 1467.4586 1469.4279 1470.4061 1475.6898 1511.1480 1598.6630 1617.9585 1644.5554 2960.1268 2967.7203 2973.8237 3049.0936 3058.4878 3131.2491 3132.5625 3179.3809 3183.4530 3479.7488
redmass: 4.6988 3.0076 3.7464 2.8380 6.8292 4.2131 5.3802 2.8799 4.3979 1.3077 1.3717 4.8019 2.9343 8.3318 5.7597 8.1290 5.3240 2.9668 6.5413 7.2685 4.2966 6.1196 8.8200 6.2053 2.1022 1.2450 6.1125 1.5555 2.0431 6.7093 1.5314 7.9744 3.9407 1.2581 1.2552 3.7547 1.3837 1.5769 2.2049 2.9629 1.4453 3.3017 2.3351 2.2055 2.2940 1.6045 1.4030 1.5826 1.0495 1.0500 1.0919 1.0720 3.1761 7.9777 7.1521 4.3399 1.0332 1.0327 1.0855 1.1042 1.1045 1.0991 1.1001 1.0912 1.0901 1.0753
irintensity: 2.3594 6.1281 0.2574 0.0219 3.8031 14.2223 2.5423 0.0017 4.8881 0.4439 0.7192 0.4881 0.3313 0.8048 4.2760 0.1935 21.2096 8.3742 4.0007 6.2635 6.1093 7.2707 2.0011 63.9501 1.9096 83.4281 19.0648 87.6195 0.0983 5.6367 13.0836 97.0772 49.4606 0.0745 0.0777 5.2701 19.3014 5.0416 284.7943 138.8911 49.4762 36.9528 29.1767 125.6677 78.1452 13.7423 31.5042 3.2248 15.7659 14.8662 95.7010 24.5763 234.9523 5.1134 121.4186 624.2702 57.2485 59.3171 62.2089 45.7639 41.8960 18.4504 16.0366 2.4105 3.7646 55.0296
temp: 298.150 k
press: 1.00000 atm
elementType: 17 8 8 8 7 6 6 6 6 6 6 6 6 6 1 1 1 1 1 1 1 1 1 1
symmnumber: 1
zpe: 467696.6 jmol-1
zpe.correction: 0.178136 hartree
zpe.thermalcorrener: 0.192570 hartree
zpe.thermalcorrenthalpy: 0.193514 hartree
zpe.thermalcorrgfe: 0.135920 hartree
zpe.sumelectzpe: -1088.370443 hartree
zpe.sumelectthermal: -1088.356009 hartree
zpe.sumelectthermalent: -1088.355065 hartree
zpe.sumelectthermalfe: -1088.412659 hartree
dipole: -1.7168 1.4247 -0.0013
dipole: 2.2309
quadrupole: -120.0440 -64.2529 -90.8874
quadrupole: 16.1934 -0.0047 0.0052
quadrupole: -28.3159 27.4752 0.8407 16.1934 -0.0047 0.0052
hfenergy: -1088.5485794 hartree
pointgroup: C01 [X(C9H10Cl1N1O3)]
dipole: 0.7454428 -0.4633628 -0.0005084 debye
dipolederiv: -0.8210371 0.0732858 -0.0000874 0.1399621 -0.0964591 0.0000199 -0.0000988 0.0000182 -0.0395199 -0.5024661 -0.5562836 0.00003 -0.3536971 -1.571693 0.000085 -0.0000275 0.0000432 -0.2912993 -0.4937538 -0.5675335 0.0000254 -0.5257104 -1.4576435 0.0000436 0.0000087 0.0000068 -0.2769308 -1.6859186 0.4379526 -0.0004185 0.056225 -0.4715564 0.0000616 0.0016425 -0.0004967 -0.3709418 -1.4620852 0.2879555 0.0001355 1.104298 -0.67304 -0.0001684 -0.0003233 0.0000595 -0.3067996 1.314508 -0.1039549 0.0000687 -0.4254608 -0.0457828 0.000009 0.0002184 0.0000607 0.1019551 -0.0192622 0.7717001 -0.0000457 0.7227133 0.8930857 -0.0000137 -0.0002771 0.0000657 0.0098076 -0.2193265 -0.1767546 0.0000247 -0.0443556 -0.1161227 0.0000172 0.0000454 -0.0000293 -0.2321624 0.113549 0.764426 -0.0000808 0.7607159 0.9873872 0.000019 -0.000057 0.0000456 0.1285339 -0.0542162 -0.1647441 0.0000144 0.1328143 -0.0776252 0.0000069 0.0000046 -0.0000372 -0.1103361 1.0443818 -0.0594521 0.0001376 -0.5806267 -0.1048168 -0.000075 0.0001644 -0.0000187 -0.1299186 0.1897214 -0.2360916 0.0000093 0.0527472 0.9283102 -0.000056 -0.0000218 -0.0001171 0.3266348 0.1660982 -0.2143608 0.0000003 0.1339029 0.8479936 -0.0000324 -0.0000312 -0.0000668 0.3278247 2.0501158 -0.5233922 0.0002469 -0.9503207 0.9971139 0.000053 -0.0014497 0.0006317 0.1505723 0.0698371 0.0835398 -0.0000145 0.0698988 -0.0300318 0.0000085 0.0000099 -0.0000063 0.171213 0.0990492 0.0518505 -0.00001 0.0495433 -0.0148634 0.0000202 0.0000168 0.0000375 0.1668421 0.1835045 -0.0072814 -0.0000203 0.0022348 0.2376748 0.0000341 0.0000651 0.000095 0.326556 -0.0291346 -0.1366883 0.0000012 -0.0758253 -0.026963 0.0000111 -0.0000039 0.0000069 0.1275242 0.0233697 0.1481649 -0.1169619 -0.0149741 -0.0165012 -0.0081922 -0.0917319 0.0565355 -0.0798373 0.0233174 0.1482202 0.1169526 -0.0149441 -0.0165229 0.0081561 0.0917648 -0.0565187 -0.0797724 0.0303419 0.1465815 -0.1225883 -0.0202677 -0.0192276 -0.0060046 -0.0923067 0.0516315 -0.0855246 -0.0297724 -0.1357577 -0.0000046 -0.0878068 -0.0247636 0.0000035 -0.0000092 -0.0000031 0.1271236 0.0302872 0.1466188 0.1225883 -0.0202513 -0.0192388 0.0059834 0.0923395 -0.0516085 -0.0854667 -0.0211084 -0.1780005 -0.0000027 -0.110815 -0.1087136 0.0000101 0.0000579 -0.0003353 0.1239221 unknown
polarizability: 197.068093|-1.6320545|153.1624161|0.0038332|-0.0079399|59.0539751 unknown
InChI: InChI=1S/C9H10ClNO3/c1-13-8-4-7(11-5-12)9(14-2)3-6(8)10/h3-5,11H,1-2H3
charge 0 multiplicity 1
24 atoms
Cl 3.784962 -0.559724 0.000402
O  -1.167458 -2.385941 -0.000024
O  2.334477 2.028583 0.000035
O  -4.310169 1.093302 0.000571
N  -2.235817 0.030995 -0.000406
C  -0.820526 -0.028404 -0.000205
C  -0.23725 -1.329448 -0.00001
C  0.023181 1.106822 -0.000176
C  1.433667 0.960724 -0.000002
C  1.16234 -1.482925 0.000175
C  1.98574 -0.343776 0.000167
C  -0.64414 -3.753579 0.000275
C  1.78293 3.385864 -0.000157
C  -3.050209 1.151709 -0.000953
H  -0.407691 2.109746 -0.000245
H  1.625063 -2.472574 0.000317
H  -2.709556 -0.881075 -0.000117
H  -1.530931 -4.403426 0.000273
H  -0.03832 -3.946019 0.906339
H  -0.038096 -3.946325 -0.905574
H  1.175307 3.574052 -0.906828
H  2.661262 4.046964 -0.000115
H  1.175094 3.574223 0.906335
H  -2.49986 2.115531 -0.000075
