program: Gaussian 09
title: 000241595
version: EM64L-G09RevD.01
frameworkgroup: C1[X(C12H20O2)]
method: RPBEPBE
basis: SDD
operation: Freq
keyword: #pfreq=noraman
keyword: PBEPBE/SDD
title: #p freq=noraman PBEPBE/SDD
converged: YES YES NO NO
title: Mulliken charges:
elementType: O O C C C C C C C C C C C C H H H H H H H H H H H H H H H H H H H H
charge: -0.412033 -0.245008 -0.322120 0.452513 -0.533610 -0.419406 -0.460727 -0.409753 -0.429401 -0.399758 -0.343204 0.143018 -0.358111 -0.696494 0.260019 0.261864 0.210921 0.203704 0.204696 0.203697 0.239071 0.200501 0.206953 0.211352 0.212347 0.212987 0.203555 0.190486 0.196245 0.207860 0.207977 0.211480 0.215680 0.372700
chargesum: 0.00000
title: Mulliken charges with hydrogens summed into heavy atoms:
elementType: O O C C C C C C C C C C C C
charge: -0.039333 -0.245008 -0.062100 0.452513 -0.060824 -0.011007 -0.017960 -0.002299 -0.005701 -0.186771 0.050836 0.143018 0.045993 -0.061357
polarizability: 1.32640182e+02 3.84080161e+00 1.39114469e+02 -7.61469365e-01 -6.88191593e+00 1.25244721e+02
1716.lowfreq: -16.1286 -11.2759 -0.0007 -0.0003 0.0005 9.9737 30.3967 40.4717 50.8539
frequency: 29.7264 40.3756 50.5887 75.0308 82.9274 92.4010 145.9135 162.7123 183.5799 230.7637 239.8441 271.1084 278.9172 304.7807 339.8683 387.0583 446.5632 465.0049 479.9401 538.3579 591.6661 610.6374 643.7226 719.0160 725.1441 762.8588 802.0383 809.7492 838.9167 844.3626 858.8108 905.4900 918.3027 923.3577 940.1735 964.8807 977.6508 1036.9191 1046.8154 1059.3256 1075.8023 1078.0786 1097.1513 1112.1474 1118.7188 1135.7857 1154.4137 1175.4272 1206.5922 1228.6949 1239.4323 1242.7656 1266.3663 1283.8525 1291.3994 1306.8012 1324.3603 1327.6448 1335.1357 1338.4560 1347.1952 1354.3328 1359.3779 1380.0915 1389.3362 1454.0051 1456.3083 1462.9958 1468.6949 1472.5071 1473.6806 1477.7253 1477.9252 1485.9772 1649.1426 1676.2116 2949.9138 2951.5628 2964.1750 2971.6108 2972.5746 2976.1367 2979.6421 2982.2481 3002.8607 3007.4763 3018.5584 3032.1865 3038.2068 3040.6711 3047.0651 3058.2958 3068.6393 3071.1820 3090.1027 3498.0621
redmass: 3.4692 6.6134 3.2576 1.8718 2.7076 3.9861 3.7604 2.5882 3.6315 1.3563 1.6303 2.7365 2.5161 2.0570 3.4818 3.6215 2.5184 2.7613 2.7668 3.1839 1.7549 3.6529 1.5963 3.1896 1.2846 2.2403 1.2997 1.8669 1.7893 2.0142 1.9881 2.6960 1.6287 1.3656 2.7194 2.1607 2.1330 2.9503 2.1740 2.0684 1.5311 1.8412 2.0023 2.0013 1.9502 1.2213 2.2793 1.5402 1.3583 1.3894 1.3068 1.3263 1.1728 1.3105 1.1908 1.3697 1.3690 1.3849 1.3554 1.6263 1.5084 1.5531 1.5360 1.6632 1.2133 1.0912 1.0772 1.0831 1.0867 1.0824 1.0625 1.0905 1.0437 1.0754 7.9429 6.7391 1.0635 1.0659 1.0581 1.0378 1.0593 1.0658 1.0622 1.0653 1.0919 1.0965 1.0923 1.0987 1.0985 1.0938 1.1041 1.0926 1.1008 1.0993 1.0905 1.0637
irintensity: 0.0375 2.1344 0.3249 0.1145 0.1833 0.6111 0.2236 0.1958 2.5044 1.1055 1.1161 0.3976 1.2695 0.8216 3.5513 3.0522 0.4095 12.9880 0.9802 5.0760 62.8517 39.7847 70.0027 26.6660 18.8395 1.4039 9.0951 2.2628 6.5384 0.6044 4.8363 8.6475 4.8283 4.2693 15.2638 22.8817 13.3694 0.1142 235.5461 5.4159 1.9362 1.0071 2.3362 0.2732 22.3086 5.8567 1.6787 1.0369 4.5159 2.0780 1.2127 2.3908 1.6357 3.5579 1.7326 9.1048 15.2129 19.1830 2.2189 1.6215 4.6900 28.5998 3.0875 3.8326 11.7762 3.4609 4.0737 23.8295 8.0886 4.1986 4.6945 4.9258 13.4954 13.4738 200.9807 0.9539 37.6202 31.8344 2.1422 30.2645 68.4796 29.5127 34.2960 21.0803 47.9657 2.8040 9.5689 39.9256 62.3995 15.1958 67.6614 33.0443 86.3227 48.5084 28.7187 17.5686
temp: 298.150 k
press: 1.00000 atm
elementType: 8 8 6 6 6 6 6 6 6 6 6 6 6 6 1 1 1 1 1 1 1 1 1 1 1 1 1 1 1 1 1 1 1 1
symmnumber: 1
zpe: 779193.6 jmol-1
zpe.correction: 0.296779 hartree
zpe.thermalcorrener: 0.312231 hartree
zpe.thermalcorrenthalpy: 0.313176 hartree
zpe.thermalcorrgfe: 0.252761 hartree
zpe.sumelectzpe: -618.609160 hartree
zpe.sumelectthermal: -618.593707 hartree
zpe.sumelectthermalent: -618.592763 hartree
zpe.sumelectthermalfe: -618.653178 hartree
dipole: 0.2291 -1.1386 0.9376
dipole: 1.4927
quadrupole: -83.8826 -85.0359 -87.6938
quadrupole: 1.9916 -2.6072 4.9385
quadrupole: 1.6548 0.5015 -2.1563 1.9916 -2.6072 4.9385
hfenergy: -618.9059387 hartree
pointgroup: C01 [X(C12H20O2)]
dipole: -0.0434352 0.4618297 0.3601369 debye
polarizability: 133.5136868|4.4398953|138.4780835|1.4378418|6.5319773|125.0076019 unknown
InChI: InChI=1S/C12H20O2/c1-2-3-9-11(12(13)14)10-7-5-4-6-8-10/h7,11,13H,2-6,8-9H2,1H3
charge 0 multiplicity 1
34 atoms
O  -0.063251 -2.938422 1.435104
O  0.402929 -2.976007 -0.835681
C  -0.562411 -0.922303 0.186246
C  0.631109 0.045771 0.096535
C  1.38315 0.129748 -1.226787
C  2.767526 0.80045 -1.068721
C  -1.600556 -0.728583 -0.960592
C  2.659296 2.096214 -0.234203
C  2.140953 1.78213 1.189809
C  0.995549 0.785021 1.181692
C  -2.234915 0.681246 -0.994038
C  -0.033319 -2.351671 0.159325
C  -3.07904 1.032187 0.253736
C  -3.809254 2.385088 0.111067
H  -1.053497 -0.781539 1.164191
H  1.49406 -0.885463 -1.655024
H  0.775891 0.701829 -1.960552
H  3.45999 0.098692 -0.561931
H  3.197126 1.015088 -2.065738
H  -2.40169 -1.485737 -0.840308
H  -1.107364 -0.948028 -1.925786
H  1.95788 2.792247 -0.736681
H  3.6384 2.60875 -0.177408
H  1.817576 2.714801 1.694851
H  2.967975 1.37705 1.812289
H  0.442314 0.659611 2.124539
H  -1.441674 1.446188 -1.11805
H  -2.881542 0.750575 -1.892911
H  -3.820059 0.225947 0.432064
H  -2.42679 1.064928 1.14864
H  -4.501031 2.372762 -0.752498
H  -3.087807 3.208447 -0.049828
H  -4.399954 2.625225 1.014211
H  0.322929 -3.85544 1.378335
