program: Gaussian 09
title: 000241589
version: EM64L-G09RevD.01
frameworkgroup: C1[X(C24H26O6)]
method: RPBEPBE
basis: SDD
operation: Freq
keyword: #pfreq=noraman
keyword: PBEPBE/SDD
title: #p freq=noraman PBEPBE/SDD
converged: YES YES NO NO
title: Mulliken charges:
elementType: O O O O O O C C C C C C C C C C C C C C C C C C C C C C C C H H H H H H H H H H H H H H H H H H H H H H H H H H
charge: -0.254901 -0.242852 -0.207993 -0.229962 -0.225630 -0.246421 -0.136168 -0.267703 -0.312671 -0.756665 0.200501 0.230426 0.203431 0.216972 -0.786183 -0.789175 -0.487577 -0.478528 0.468815 0.459675 -0.362842 -0.369869 -0.390736 -0.373885 -0.226095 -0.224893 -0.225192 -0.228701 -0.231514 -0.230292 0.293648 0.314481 0.322040 0.227649 0.246846 0.239034 0.258997 0.246864 0.272738 0.236457 0.245687 0.280124 0.227406 0.243880 0.237447 0.228746 0.266055 0.238050 0.235240 0.263055 0.231133 0.229131 0.229269 0.230016 0.231812 0.230821
chargesum: 0.00000
title: Mulliken charges with hydrogens summed into heavy atoms:
elementType: O O O O O O C C C C C C C C C C C C C C C C C C C C C C C C
charge: -0.254901 -0.242852 -0.207993 -0.229962 -0.225630 -0.246421 0.157480 0.046779 0.009369 -0.043136 0.200501 0.230426 0.203431 0.216972 -0.007583 -0.026907 -0.016290 -0.012334 0.468815 0.459675 -0.096788 -0.131819 -0.155496 -0.110831 0.005038 0.004238 0.004077 0.001315 0.000298 0.000529
polarizability: 3.01024426e+02 -8.11949784e+00 2.61075799e+02 -1.48167936e+01 -3.62569545e+00 2.37839986e+02
1716.lowfreq: -13.6632 -6.2431 -6.1058 -0.0010 -0.0001 0.0007 2.3671 8.9863 15.8899
frequency: -6.0958 3.8608 15.5738 16.8109 23.3564 24.5651 33.6798 41.2846 47.9496 54.0070 76.2748 79.6607 99.1031 118.9119 129.0738 138.2316 147.9771 153.8611 162.6992 171.5428 186.6418 203.2155 214.7686 228.6300 246.1249 265.6014 271.3267 294.0485 305.9906 336.4442 342.0568 357.6231 390.9715 396.6599 401.9914 404.4547 458.6706 470.1251 475.7158 497.1788 503.0906 515.2751 581.8140 586.5538 594.7687 615.1227 616.7110 617.4073 643.5605 673.6528 701.4048 704.1748 704.7210 723.2919 751.0714 756.1442 782.4530 816.6963 817.2574 819.8735 831.3493 835.6508 856.9968 860.0183 883.7545 910.4018 934.1574 937.6477 941.5790 946.6536 968.6835 977.1873 979.3314 981.7938 984.7837 990.2497 990.4497 992.4666 1000.6488 1002.5573 1019.4751 1026.1784 1026.7175 1031.4999 1056.3886 1085.6981 1090.7565 1091.4712 1093.6675 1129.5582 1148.5574 1173.9821 1174.4382 1183.6586 1189.1484 1189.7747 1201.6293 1218.6649 1221.2306 1223.1167 1230.7516 1230.8591 1238.1485 1276.0986 1293.4782 1329.8862 1330.1412 1336.1921 1342.3666 1344.5401 1351.0656 1368.3446 1372.0254 1385.4548 1385.5185 1395.8098 1442.3457 1442.6199 1444.9931 1445.7714 1450.6523 1451.8523 1460.6184 1462.6841 1478.2393 1482.2432 1484.1824 1485.0650 1594.0027 1594.2984 1612.7933 1614.0165 1614.7300 1619.1688 1621.0899 1642.4826 2960.7753 2984.9437 2985.9124 2988.0137 3033.2820 3040.5799 3041.6728 3066.7796 3073.2014 3075.2676 3077.7182 3089.5037 3116.1704 3117.3423 3120.8516 3123.3472 3123.4074 3126.6906 3129.5122 3129.8680 3140.7864 3141.1340 3151.7033 3152.2138 3166.1290 3166.4087
redmass: 4.6987 5.5786 4.6712 4.9013 5.2692 4.6864 5.2599 4.3248 4.9983 6.1748 4.6809 4.8537 7.1623 5.1219 4.7560 1.9577 1.8040 1.0779 3.7738 4.7776 3.0832 3.4414 3.2789 1.9193 5.2788 5.3554 5.0395 5.1101 3.4269 2.9589 2.9960 3.3382 2.8286 3.6815 2.7951 2.8189 3.3990 3.4723 3.6856 4.0975 4.1223 3.4517 4.9187 4.5885 4.4328 4.5511 6.2030 6.0739 4.9127 4.6595 1.8560 3.3347 2.1982 4.6390 2.1437 2.1331 3.1903 3.7756 3.6108 3.9057 3.5338 4.3438 1.2488 1.2483 2.7787 4.6063 1.5352 1.5663 2.6397 2.3223 1.7771 1.9304 1.8753 1.4381 1.4294 5.2990 5.1874 1.6379 1.3462 1.3319 1.8350 2.2137 2.2069 1.9631 2.1677 2.8515 1.5554 1.6151 2.7186 3.2308 2.1400 1.0542 1.0544 2.3138 1.1180 1.1249 2.1430 1.6564 2.6680 2.6002 1.2170 1.1598 1.8508 1.4641 1.5264 1.2617 1.2598 1.3601 1.2696 1.3655 1.3342 1.2371 1.2358 8.1382 8.1470 1.1986 2.1630 2.1767 1.0671 1.0565 1.0692 1.0735 1.1346 1.1314 1.0571 1.0444 2.2947 2.2998 6.0732 6.0912 7.3994 6.0767 6.1182 7.8670 8.9178 9.1019 1.0785 1.0376 1.0357 1.0365 1.0840 1.0585 1.0586 1.0845 1.0934 1.0961 1.0987 1.1002 1.1067 1.1075 1.0879 1.1003 1.0867 1.1018 1.0879 1.0872 1.0920 1.0922 1.0965 1.0966 1.1017 1.1016
irintensity: 0.0473 0.4322 1.0506 0.2250 0.0945 0.1561 1.4750 0.8030 0.6881 2.2178 5.7948 7.3112 1.2887 1.5504 0.8515 1.8685 0.7525 0.5983 0.5747 0.9599 2.3958 3.3168 1.8284 2.9448 11.2177 8.4810 2.7931 4.3376 2.4857 2.4345 1.9985 2.3513 11.0304 7.3086 0.0255 0.0718 1.6831 1.9905 21.8875 10.5033 2.3500 5.6118 9.6300 26.9655 17.6087 4.8375 0.1893 0.4991 15.7156 21.4957 55.6501 21.5559 32.7153 13.0273 82.6300 77.6728 1.2704 13.0375 8.5376 7.0661 27.0269 3.9054 0.4862 0.4537 0.5483 74.5096 14.1948 9.5524 43.3985 10.0053 24.8316 29.1902 10.0042 2.0944 1.0362 2.6681 0.7873 27.7372 0.3621 0.4111 17.0868 3.9959 8.0613 33.8869 160.1079 181.2143 5.7447 5.2040 119.9845 201.6970 17.5522 0.0776 0.0612 116.5408 0.6309 2.7402 7.9647 251.2153 17.9036 20.0344 10.1063 3.3595 72.5510 139.6650 49.4941 1.2180 1.6707 16.5246 21.6908 13.1132 5.3235 79.8916 67.7542 0.8213 0.7243 16.2922 8.5191 9.5498 23.3306 22.9329 20.2531 21.0056 20.8927 16.6372 2.9342 8.2934 6.8871 7.7147 2.5298 2.7456 47.6449 1.3589 2.8237 81.1094 123.2816 188.7639 31.5390 1.1756 15.0670 3.3827 0.3774 31.7102 32.8411 6.2501 2.2406 5.9108 35.0695 13.7076 3.2129 4.0274 6.4735 13.2083 3.3687 9.1473 1.3880 1.2059 14.0985 16.7748 26.4073 26.4563 19.1892 20.1719
temp: 298.150 k
press: 1.00000 atm
elementType: 8 8 8 8 8 8 6 6 6 6 6 6 6 6 6 6 6 6 6 6 6 6 6 6 6 6 6 6 6 6 1 1 1 1 1 1 1 1 1 1 1 1 1 1 1 1 1 1 1 1 1 1 1 1 1 1
symmnumber: 1
zpe: 1167384.4 jmol-1
zpe.correction: 0.444633 hartree
zpe.thermalcorrener: 0.474243 hartree
zpe.thermalcorrenthalpy: 0.475187 hartree
zpe.thermalcorrgfe: 0.377314 hartree
zpe.sumelectzpe: -1379.301430 hartree
zpe.sumelectthermal: -1379.271820 hartree
zpe.sumelectthermalent: -1379.270876 hartree
zpe.sumelectthermalfe: -1379.368749 hartree
dipole: -1.2161 -1.3825 -0.2154
dipole: 1.8538
quadrupole: -150.4762 -169.8824 -172.3815
quadrupole: -4.4599 4.4900 4.5645
quadrupole: 13.7705 -5.6357 -8.1348 -4.4599 4.4900 4.5645
hfenergy: -1379.746063 hartree
pointgroup: C01 [X(C24H26O6)]
dipole: 0.4306991 0.5102532 0.2933623 debye
polarizability: 298.3378196|-15.5240067|250.1233259|14.9118096|10.1436817|251.479066 unknown
InChI: InChI=1S/C24H26O6/c1-16(21(17(2)25)23(27)29-14-19-10-6-4-7-11-19)22(18(3)26)24(28)30-15-20-12-8-5-9-13-20/h4-13,16,21-22H,14-15H2,1-3H3
charge 0 multiplicity 1
56 atoms
O  2.906129 0.917621 -0.634446
O  -3.039523 -1.335815 0.636738
O  1.095193 -2.558449 0.755265
O  0.012567 -2.199266 -2.94097
O  1.256234 1.151622 1.003716
O  -3.648661 -1.631393 -1.593094
C  -0.503337 -0.491296 -0.633129
C  1.046738 -0.607807 -0.743221
C  -1.263625 -1.841386 -0.88294
C  -0.997639 0.63491 -1.573945
C  1.67156 -1.907581 -0.155692
C  -0.940999 -2.570963 -2.202134
C  1.703022 0.57228 -0.01155
C  -2.767189 -1.61072 -0.701251
C  2.990608 -2.344759 -0.760132
C  -1.761938 -3.801623 -2.543732
C  3.721236 2.008639 0.028811
C  -4.467439 -0.960658 0.975909
C  4.724792 1.421249 0.994246
C  -4.695651 0.525138 0.818044
C  4.360766 1.166802 2.342683
C  -4.385402 1.413218 1.879774
C  6.039887 1.112043 0.562369
C  -5.222214 1.048429 -0.391325
C  5.296603 0.606405 3.239334
C  -4.592822 2.80256 1.735606
C  6.977162 0.553417 1.459666
C  -5.432148 2.437941 -0.535512
C  6.606233 0.298768 2.800722
C  -5.118189 3.317469 0.527153
H  -0.73447 -0.210234 0.410579
H  1.360322 -0.559968 -1.798909
H  -0.949872 -2.526261 -0.065005
H  -0.475306 1.582254 -1.350277
H  -2.078195 0.822215 -1.442263
H  -0.815495 0.376504 -2.631965
H  2.806507 -2.702092 -1.792239
H  3.43655 -3.156692 -0.165632
H  3.686413 -1.490704 -0.83618
H  -1.944885 -4.42762 -1.651207
H  -1.248716 -4.387972 -3.321423
H  -2.750833 -3.477641 -2.917888
H  4.205868 2.502688 -0.827309
H  3.0149 2.692896 0.52866
H  -5.134262 -1.55244 0.326182
H  -4.550803 -1.286689 2.024087
H  3.343605 1.400645 2.67719
H  -3.974744 1.015085 2.815675
H  6.328643 1.309302 -0.477594
H  -5.451561 0.36369 -1.215501
H  5.006755 0.411383 4.277665
H  -4.348444 3.480738 2.560589
H  7.991489 0.32044 1.117152
H  -5.839821 2.833603 -1.472341
H  7.332118 -0.133954 3.498299
H  -5.282114 4.395221 0.415395
