program: Gaussian 09
title: 000241565
version: EM64L-G09RevD.01
frameworkgroup: C1[X(C18H26N2O3)]
method: RPBEPBE
basis: SDD
operation: Freq
keyword: #p
keyword: freq=noraman
keyword: PBEPBE/SDD
title: #p freq=noraman PBEPBE/SDD
converged: YES YES NO NO
title: Mulliken charges:
elementType: O O O N N C C C C C C C C C C C C C C C C C C H H H H H H H H H H H H H H H H H H H H H H H H H H
charge: -0.308609 -0.252870 -0.293410 -0.214756 -0.518957 0.027583 -0.428218 -0.442704 -0.393498 -0.394396 -0.388867 -0.460998 0.247821 -0.489997 0.317736 0.447632 -0.459808 -0.347268 -0.265343 -0.199624 -0.217416 -0.265899 -0.659493 0.168811 0.182492 0.262617 0.259171 0.190954 0.200156 0.181960 0.181935 0.200090 0.202614 0.194146 0.238516 0.250452 0.255400 0.248569 0.370876 0.237216 0.302334 0.229085 0.237332 0.218437 0.218928 0.222180 0.223203 0.230466 0.253423
chargesum: 0.00000
title: Mulliken charges with hydrogens summed into heavy atoms:
elementType: O O O N N C C C C C C C C C C C C C C C C C C
charge: -0.308609 -0.252870 -0.293410 -0.214756 -0.148081 0.196394 0.016890 0.007421 -0.011383 -0.012371 0.007893 0.027971 0.247821 0.013972 0.317736 0.447632 -0.222592 -0.044934 0.201073 0.018813 0.001512 -0.043719 0.047599
polarizability: 2.82055155e+02 1.27919117e+01 2.28874356e+02 -7.03159405e+00 -1.03066290e+01 1.55978801e+02
1716.lowfreq: -8.7318 -6.7056 -0.0008 0.0002 0.0005 7.5319 16.3832 20.2878 38.7080
frequency: 15.3835 20.1104 38.6279 45.4641 52.4686 59.9192 64.1248 85.2509 103.4698 118.6256 137.1173 149.0427 161.9633 209.6415 215.3726 221.7433 226.0542 249.6827 292.3361 314.2534 330.6796 353.2305 357.5905 366.9910 405.0707 408.6049 438.4967 460.2262 465.0182 496.6863 513.9400 524.9373 544.1122 605.0995 619.3973 624.1544 646.7002 696.5795 707.5968 761.0515 768.6238 784.3832 788.5511 803.9940 814.7396 830.3522 842.8367 849.1497 864.0382 871.5310 882.7615 896.5891 912.2674 918.0300 935.6451 964.5297 968.8592 982.4381 989.6227 991.0413 1008.9810 1025.8818 1041.0287 1045.8532 1052.0931 1072.6254 1084.8757 1096.2755 1102.5274 1111.2391 1121.2505 1155.4806 1166.3776 1169.1575 1174.6529 1186.7522 1191.8711 1196.6163 1231.2585 1246.6358 1254.2544 1262.8747 1276.6608 1277.2920 1300.5499 1303.2466 1320.3130 1326.1626 1333.4778 1336.9061 1339.5441 1342.3723 1351.1787 1358.2865 1367.3454 1383.4240 1393.8121 1409.8340 1427.7612 1434.8154 1457.8060 1461.6147 1464.0560 1464.3466 1470.1849 1473.4527 1482.6310 1484.0322 1485.4507 1489.3791 1541.6756 1591.9971 1609.5361 1618.5188 1631.6301 2943.4737 2954.0328 2955.4036 2969.6902 2972.6643 2979.4996 2991.1022 2993.7784 2995.9137 3023.9211 3027.7138 3035.6228 3036.9822 3056.4980 3063.8061 3070.9196 3075.1824 3091.3718 3098.1795 3115.7193 3124.8178 3126.5946 3138.4717 3160.0123 3194.2884 3321.7771
redmass: 3.8707 3.8307 4.0245 3.6378 3.4489 3.9328 3.9873 4.9697 4.9308 4.4194 3.5926 4.7439 3.1901 2.2093 2.5402 1.8586 2.9802 2.5300 3.5648 2.1984 3.0161 4.4513 2.9188 3.9075 3.1869 2.9645 3.3161 2.9301 2.0310 3.5195 2.9239 2.4799 3.0322 5.5672 5.9773 3.4653 4.1418 1.9923 7.8855 1.6750 2.0701 2.0406 1.5635 1.5554 1.6764 3.1510 1.6184 2.4469 1.9701 2.2438 1.8459 1.5112 1.4629 1.8361 2.6509 2.2508 1.3538 4.8158 2.3675 1.3766 2.4936 2.1791 3.1244 1.7670 1.0928 1.3909 1.6702 2.1884 2.6484 2.5702 2.5217 1.7555 2.6688 1.0758 2.6621 1.1231 1.5888 1.7777 1.5132 1.3338 1.2956 1.4266 1.2035 2.0035 1.3860 1.4151 1.4044 1.3876 1.4157 1.5230 1.4600 1.4177 1.4959 1.3428 1.5030 4.3622 1.2295 1.5910 1.0962 2.4888 1.1006 1.0870 1.0429 1.0894 1.0857 1.0873 1.1183 1.0662 1.0934 2.4074 2.4792 7.9675 5.6264 5.3818 2.5971 1.0822 1.0642 1.0644 1.0688 1.0617 1.0655 1.0645 1.0656 1.0362 1.0968 1.0936 1.0596 1.1037 1.0947 1.0982 1.0987 1.0935 1.0973 1.1031 1.0858 1.1069 1.0878 1.0944 1.0999 1.0945 1.0810
irintensity: 0.3852 0.2751 0.2296 1.2345 0.5951 0.7238 0.3833 1.1793 0.5592 4.7336 1.4711 3.8554 0.7841 3.6537 5.4610 0.4993 4.4828 1.3455 2.9869 5.0135 14.5488 2.8073 5.9498 0.8838 19.8195 0.2893 1.6048 3.2694 1.8187 8.1275 22.9356 8.3902 8.6735 2.4793 3.8089 0.5763 8.5806 36.5232 6.3138 40.4147 14.9204 0.5626 0.4012 69.4271 27.6545 5.3623 2.5661 6.4813 14.8369 13.6970 7.1379 18.5409 21.4633 0.1902 12.5559 25.7489 0.9717 0.9142 9.0895 1.3128 75.8915 13.8324 16.7889 0.2154 0.9419 1.8616 18.3414 32.3591 3.3058 0.2588 40.6222 17.5933 246.1787 14.1817 24.0450 1.1762 24.8044 201.4793 123.6327 1.1387 1.6544 1.8795 14.9570 135.1646 11.0952 3.3361 62.8203 6.8158 24.2324 113.5421 1.6632 17.5379 67.2826 9.7932 24.5591 58.8732 20.0280 76.5471 31.8296 58.5875 14.1104 6.7758 15.1180 4.3131 8.3608 14.4668 15.1087 14.7142 8.9782 165.5942 370.1550 129.8078 441.1980 36.3602 25.2055 21.9715 19.5744 68.6557 37.2744 33.8961 59.0844 38.6833 27.6125 14.2905 70.0238 62.2009 29.3476 53.7225 1.5710 7.3057 42.1189 13.4283 30.6869 1.2735 9.4963 31.0100 3.5668 37.8999 34.4810 6.1118 473.0760
temp: 298.150 k
press: 1.00000 atm
elementType: 8 8 8 7 7 6 6 6 6 6 6 6 6 6 6 6 6 6 6 6 6 6 6 1 1 1 1 1 1 1 1 1 1 1 1 1 1 1 1 1 1 1 1 1 1 1 1 1 1
symmnumber: 1
zpe: 1090348.8 jmol-1
zpe.correction: 0.415292 hartree
zpe.thermalcorrener: 0.438153 hartree
zpe.thermalcorrenthalpy: 0.439097 hartree
zpe.thermalcorrgfe: 0.360401 hartree
zpe.sumelectzpe: -1034.970305 hartree
zpe.sumelectthermal: -1034.947444 hartree
zpe.sumelectthermalent: -1034.946500 hartree
zpe.sumelectthermalfe: -1035.025195 hartree
dipole: 1.9393 5.9591 -1.5361
dipole: 6.4522
quadrupole: -134.3756 -126.3638 -135.5805
quadrupole: -5.1633 -3.2027 1.9378
quadrupole: -2.2690 5.7429 -3.4739 -5.1633 -3.2027 1.9378
hfenergy: -1035.385597 hartree
pointgroup: C01 [X(C18H26N2O3)]
dipole: 2.44162 0.333924 -0.6090092 debye
polarizability: 248.8626206|-28.7164557|261.9874862|-12.6868342|2.3645385|156.0582054 unknown
InChI: InChI=1S/C18H26N2O3/c1-2-23-17(21)13-14-20(16-11-7-4-8-12-16)18(22)19-15-9-5-3-6-10-15/h3,5-6,9-10,16,19H,2,4,7-8,11-14H2,1H3
charge 0 multiplicity 1
49 atoms
O  -1.628215 -1.181642 0.478549
O  3.880849 1.65404 -0.28015
O  1.637615 2.175682 -0.577789
N  0.430383 -0.983219 -0.642454
N  -0.925525 0.926525 -0.314174
C  0.797032 -2.39829 -0.314912
C  -0.141541 -3.43808 -0.985591
C  0.927437 -2.652427 1.206281
C  0.346526 -4.880111 -0.70544
C  1.41457 -4.097473 1.475651
C  0.482644 -5.141184 0.813831
C  1.126059 -0.409996 -1.815778
C  -0.777413 -0.453922 -0.127785
C  2.562102 0.087726 -1.527226
C  2.610101 1.393482 -0.753186
C  -2.086707 1.70695 -0.072033
C  -1.964205 3.112939 -0.26647
C  -3.33927 1.167716 0.332099
C  4.075587 2.922211 0.504918
C  -3.071725 3.961069 -0.067991
C  -4.439569 2.032042 0.521031
C  -4.321964 3.427455 0.325184
C  3.734373 2.696586 1.979102
H  1.810892 -2.540074 -0.750521
H  -0.186432 -3.253859 -2.078222
H  -1.159305 -3.2920 -0.582963
H  -0.056278 -2.492373 1.681303
H  1.632242 -1.917759 1.642964
H  -0.35547 -5.606282 -1.158926
H  1.33246 -5.043437 -1.191399
H  2.444528 -4.226912 1.078916
H  1.470487 -4.271738 2.567545
H  -0.519667 -5.083321 1.284749
H  0.86656 -6.164436 0.993308
H  1.195078 -1.192738 -2.59864
H  0.522551 0.408168 -2.243414
H  3.144249 -0.672257 -0.976145
H  3.099871 0.249393 -2.483734
H  -0.06809 1.464128 -0.522108
H  -0.997517 3.532431 -0.571968
H  -3.42519 0.094321 0.508046
H  5.141619 3.151802 0.351918
H  3.443948 3.70868 0.05696
H  -2.957692 5.040449 -0.221864
H  -5.400219 1.604772 0.832107
H  -5.183531 4.086201 0.47893
H  3.964594 3.611992 2.55486
H  4.328027 1.867234 2.400083
H  2.662338 2.472636 2.107543
