program: Gaussian 09
title: 000241564
version: EM64L-G09RevD.01
frameworkgroup: C1[X(C16H21N3O)]
method: RPBEPBE
basis: SDD
operation: Freq
keyword: #p
keyword: freq=noraman
keyword: PBEPBE/SDD
title: #p freq=noraman PBEPBE/SDD
converged: YES YES NO NO
title: Mulliken charges:
elementType: O N N N C C C C C C C C C C C C C C C C H H H H H H H H H H H H H H H H H H H H H
charge: -0.305795 -0.196300 -0.509303 -0.006824 0.018243 -0.427423 -0.424309 -0.394975 -0.395974 -0.389784 -0.476324 0.289773 -0.419176 0.472372 -0.146106 -0.456864 -0.340009 -0.200066 -0.214355 -0.259104 0.173245 0.262929 0.182395 0.193066 0.258006 0.203780 0.185489 0.186119 0.203587 0.198329 0.202999 0.230818 0.259403 0.269750 0.265860 0.303309 0.215206 0.309249 0.225875 0.224660 0.228233
chargesum: 0.00000
title: Mulliken charges with hydrogens summed into heavy atoms:
elementType: O N N N C C C C C C C C C C C C C C C C
charge: -0.305795 -0.196300 -0.205994 -0.006824 0.191487 0.017901 0.026762 -0.005706 -0.006268 0.011544 0.013896 0.289773 0.116434 0.472372 -0.146106 -0.241658 -0.030760 0.025809 0.010305 -0.030872
polarizability: 2.54338333e+02 3.63272346e+00 2.12310348e+02 -1.68396695e+00 -1.24801479e+01 1.22817049e+02
1716.lowfreq: -7.0214 -5.4538 -0.0001 0.0005 0.0006 1.0403 16.6515 29.8000 33.8582
frequency: 15.3614 29.6038 33.8080 43.7668 60.2319 66.5103 104.4151 122.1441 135.0056 154.7480 210.6911 221.3584 225.0483 239.8956 293.4957 306.6958 346.9543 352.6188 373.3984 405.9541 408.4360 449.7867 464.2226 472.6580 477.8831 500.3930 537.0553 557.9312 613.7584 643.1825 664.0081 695.3803 702.6159 764.5735 767.2420 787.8644 789.8558 831.8013 839.4913 846.0015 872.7357 895.0725 896.8495 913.5932 919.4366 939.9278 970.1610 973.2310 984.5325 988.7961 998.8030 1023.1438 1027.7529 1045.6255 1052.5349 1071.8447 1083.4785 1092.6184 1109.4153 1132.4227 1171.3392 1174.2307 1187.3384 1191.6434 1192.6918 1248.0654 1251.5439 1255.8000 1258.9942 1269.4936 1272.1872 1300.9908 1304.7869 1318.5297 1323.8876 1334.0783 1336.1400 1340.3581 1342.4535 1351.1429 1381.9061 1402.8552 1430.4643 1450.4879 1460.4206 1466.0922 1471.7279 1475.2886 1486.0554 1486.4257 1498.9121 1522.5958 1598.1640 1612.0126 1617.8932 2196.5721 2957.4798 2958.6211 2960.4990 2975.1783 2983.4084 2991.1932 2992.3809 3004.6206 3028.4230 3031.8965 3040.5054 3051.5861 3066.4267 3071.1178 3073.7169 3101.5739 3130.6500 3142.5011 3164.7631 3200.5150 3550.1455
redmass: 4.6095 5.8115 5.1896 3.3674 3.9114 3.2651 4.5348 5.7574 3.3864 6.5597 4.5046 1.8480 4.0563 3.8469 4.1408 2.2040 2.8229 4.2877 3.5938 3.6511 3.2072 3.9407 2.5791 2.2351 6.6594 2.1611 2.6223 1.4867 6.3566 3.8347 5.6259 2.0030 11.6940 1.6491 1.2542 1.8698 1.6452 3.3287 1.2745 3.4105 2.1609 1.8817 2.0348 1.4240 1.7836 4.7306 1.3488 2.6668 5.6262 4.6044 1.3024 2.2778 2.0833 1.8024 1.1124 1.4248 1.9968 1.8583 2.5114 2.4008 1.0683 1.6142 1.2357 2.3597 1.5470 1.3621 1.6106 1.2948 1.8394 1.2943 1.4011 1.3949 1.3204 1.4309 1.3737 1.3865 1.5348 1.4492 1.3041 1.4296 3.7044 1.6292 2.4174 1.0923 1.0874 1.0880 1.0844 1.0866 2.0956 1.1469 1.5690 1.4157 7.1869 3.8033 6.2515 12.4230 1.0816 1.0655 1.0652 1.0615 1.0655 1.0648 1.0643 1.0601 1.0971 1.0939 1.1037 1.0979 1.0994 1.1001 1.1004 1.0889 1.0865 1.0932 1.0999 1.0945 1.0750
irintensity: 1.2147 2.3836 0.0308 1.1022 0.2834 4.3814 2.5673 12.0880 1.5101 0.7059 2.6485 0.0631 2.5263 1.7546 6.2519 0.4709 0.2782 7.1250 1.0509 1.9952 0.5050 0.0672 0.6653 4.3559 4.2702 50.3366 9.3597 22.4467 0.8464 5.1746 13.5648 41.0775 13.6640 85.5358 11.4335 0.4496 0.3942 6.6237 0.0065 1.0077 4.3222 10.0283 10.1910 11.6562 0.0415 2.6226 0.2088 4.9118 0.4658 9.2053 2.8585 60.0154 2.8957 0.3193 1.6627 0.8343 12.9085 4.9331 0.1396 35.4601 4.3075 108.4765 7.2930 75.4723 1.3524 5.0782 155.3691 0.7066 15.2125 26.3953 18.7640 8.8527 1.6464 91.2153 9.0521 9.5197 102.7309 2.0398 25.8412 24.1318 86.0261 19.2569 152.0364 17.7534 7.4895 4.6916 11.1272 16.9356 44.2171 8.2069 418.5766 167.9562 92.1325 90.7798 161.4054 17.7768 8.4310 34.8870 64.1494 31.5273 61.4762 0.9795 49.8528 12.1012 64.9395 57.0612 50.1344 3.0374 2.9722 25.8030 42.3363 19.6552 0.5864 30.3319 26.8435 9.0275 6.1695
temp: 298.150 k
press: 1.00000 atm
elementType: 8 7 7 7 6 6 6 6 6 6 6 6 6 6 6 6 6 6 6 6 1 1 1 1 1 1 1 1 1 1 1 1 1 1 1 1 1 1 1 1 1
symmnumber: 1
zpe: 903232.0 jmol-1
zpe.correction: 0.344023 hartree
zpe.thermalcorrener: 0.363203 hartree
zpe.thermalcorrenthalpy: 0.364147 hartree
zpe.thermalcorrgfe: 0.293737 hartree
zpe.sumelectzpe: -860.294164 hartree
zpe.sumelectthermal: -860.274984 hartree
zpe.sumelectthermalent: -860.274040 hartree
zpe.sumelectthermalfe: -860.344450 hartree
dipole: 1.4867 -0.4649 -0.1532
dipole: 1.5652
quadrupole: -107.2907 -146.2884 -121.0905
quadrupole: -1.5402 0.3767 -0.4306
quadrupole: 17.5992 -21.3985 3.7994 -1.5402 0.3767 -0.4306
hfenergy: -860.6381874 hartree
pointgroup: C01 [X(C16H21N3O1)]
dipole: 0.570175 0.2184639 0.0800241 debye
polarizability: 254.3608648|-0.6661188|212.2985745|6.4161407|-11.3254509|122.8062914 unknown
InChI: InChI=1S/C16H21N3O/c17-12-7-13-19(15-10-5-2-6-11-15)16(20)18-14-8-3-1-4-9-14/h1,3-4,8-9,15,18H,2,5-7,10-11,13H2
charge 0 multiplicity 1
41 atoms
O  -0.039093 1.664117 -0.105505
N  1.039138 -0.352787 0.402626
N  -1.332379 -0.272628 0.207318
N  0.820962 -5.261384 -0.02405
C  2.392998 0.293602 0.3047
C  2.706847 0.853355 -1.107737
C  2.615927 1.364217 1.403755
C  4.151841 1.408193 -1.160801
C  4.058661 1.922071 1.336067
C  4.381444 2.481525 -0.070158
C  0.997518 -1.790445 0.697035
C  -0.109018 0.422412 0.152731
C  0.959768 -2.66497 -0.604843
C  -2.644459 0.256604 0.025396
C  0.884457 -4.102994 -0.304774
C  -3.725489 -0.658524 0.162533
C  -2.916453 1.616579 -0.282905
C  -5.055791 -0.225342 -0.00452
C  -4.255651 2.033522 -0.446652
C  -5.331926 1.127525 -0.31128
H  3.114916 -0.529688 0.494451
H  1.984851 1.655024 -1.340991
H  2.57372 0.054332 -1.864595
H  2.419681 0.918187 2.398416
H  1.886113 2.178991 1.253193
H  4.349105 1.831013 -2.164489
H  4.877861 0.580191 -1.014595
H  4.783684 1.117377 1.582689
H  4.186833 2.710613 2.102139
H  5.42696 2.844129 -0.105963
H  3.728273 3.353839 -0.274617
H  0.143282 -2.051869 1.350781
H  1.898776 -2.058997 1.274187
H  0.095049 -2.37714 -1.232277
H  1.868814 -2.463391 -1.200843
H  -1.315902 -1.266883 0.434972
H  -3.524035 -1.711633 0.402498
H  -2.086723 2.316602 -0.386678
H  -5.874674 -0.944862 0.105952
H  -4.455044 3.084946 -0.683387
H  -6.365044 1.466569 -0.441083
