program: Gaussian 09
title: 000241554
version: EM64L-G09RevD.01
frameworkgroup: C1[X(C10H6Cl2N2)]
method: RPBEPBE
basis: SDD
operation: Freq
keyword: #p
keyword: freq=noraman
keyword: PBEPBE/SDD
title: #p freq=noraman PBEPBE/SDD
converged: YES YES NO NO
title: Mulliken charges:
elementType: Cl Cl N N C C C C C C C C C C H H H H H H
charge: 0.005407 0.023046 0.028667 0.157537 0.344068 0.183143 -0.349702 -0.346449 -0.202269 -0.241486 -0.227041 -0.224517 -0.210067 -0.410843 0.218275 0.289882 0.253774 0.234487 0.236839 0.237249
chargesum: 0.00000
title: Mulliken charges with hydrogens summed into heavy atoms:
elementType: Cl Cl N N C C C C C C C C C C
charge: 0.005407 0.023046 0.028667 0.157537 0.344068 0.183143 -0.131427 -0.056567 0.051505 -0.007000 0.009798 0.012732 -0.210067 -0.410843
polarizability: 2.28585775e+02 -2.01221257e+00 1.67254203e+02 8.55601052e-03 -1.35272791e-01 5.10951008e+01
1716.lowfreq: -5.6000 -4.8165 -0.0029 0.0009 0.0023 5.3896 20.0691 75.7107 107.2072
frequency: 19.9932 75.7095 107.2068 144.4931 162.1646 177.7370 230.4390 285.7355 301.2713 388.6556 399.0590 435.2594 455.4654 508.9009 589.6775 614.3762 628.0977 640.4417 693.2086 750.3163 774.4183 791.6288 800.5168 851.7709 884.5788 917.0343 944.7482 989.5057 991.7698 1014.0686 1022.9400 1059.0115 1086.1993 1125.7559 1176.7845 1195.4491 1215.1586 1273.2525 1299.9690 1323.7438 1355.8929 1390.8355 1434.6189 1474.0168 1500.1167 1522.5159 1587.4353 1611.8473 3132.4016 3141.3829 3153.3854 3166.0345 3176.8257 3211.0885
redmass: 4.0348 6.5929 7.7249 6.6032 8.1188 18.5339 6.3077 7.1314 10.1771 14.3297 2.7780 14.0497 3.7663 6.6218 7.0361 6.4723 7.9310 5.2930 1.6747 4.2256 10.9769 1.8698 8.4066 1.3143 1.6016 9.5503 1.4370 6.1120 1.3785 1.3461 2.7878 2.2179 1.6827 2.9148 1.0611 1.1369 7.6245 6.0768 2.7180 1.4364 4.4903 8.0354 2.4484 3.1867 4.3983 5.8706 6.0505 5.9897 1.0852 1.0885 1.0935 1.0972 1.0988 1.0932
irintensity: 0.1031 0.0383 0.2184 3.1817 1.3025 0.2054 0.1805 1.6035 0.9482 3.5325 0.0079 12.4182 5.3437 0.0625 1.7701 0.1816 34.1946 3.7299 53.8822 9.2937 124.5150 51.8960 65.5307 2.7069 15.3620 3.9857 3.0733 4.0533 0.3623 0.5493 1.1457 12.7865 21.9094 81.0750 0.6216 19.7896 215.0821 61.8599 35.4119 24.3591 23.0418 11.7384 13.1049 205.2370 207.0298 600.8616 0.7371 12.0839 0.9212 4.2958 24.7700 16.0269 16.3470 0.3507
temp: 298.150 k
press: 1.00000 atm
elementType: 17 17 7 7 6 6 6 6 6 6 6 6 6 6 1 1 1 1 1 1
symmnumber: 1
zpe: 354124.0 jmol-1
zpe.correction: 0.134879 hartree
zpe.thermalcorrener: 0.146369 hartree
zpe.thermalcorrenthalpy: 0.147313 hartree
zpe.thermalcorrgfe: 0.095004 hartree
zpe.sumelectzpe: -1413.316107 hartree
zpe.sumelectthermal: -1413.304617 hartree
zpe.sumelectthermalent: -1413.303672 hartree
zpe.sumelectthermalfe: -1413.355981 hartree
dipole: -4.9505 -2.1365 -0.0030
dipole: 5.3919
quadrupole: -90.6353 -90.5614 -97.0577
quadrupole: 0.1900 0.0014 -0.0575
quadrupole: 2.1162 2.1901 -4.3062 0.1900 0.0014 -0.0575
hfenergy: -1413.4509853 hartree
pointgroup: C01 [X(C10H6Cl2N2)]
dipole: -1.956855 0.8066876 0.1414384 debye
dipolederiv: -0.4588671 -0.4024336 -0.0594074 -0.4729786 -0.6687858 -0.0900615 -0.0704056 -0.0904703 -0.0788574 -0.3242698 0.3218594 0.0522698 0.4490134 -0.7307987 -0.1080911 0.0721572 -0.1071365 -0.077507 -1.3155777 0.5093543 0.0887398 0.3538035 -0.6642727 -0.0835862 0.0641411 -0.0847986 -0.159687 -0.6230568 -0.0241141 0.0002726 0.1743775 -1.3997198 -0.2031881 0.0316722 -0.2012115 -0.1363047 -0.6328663 0.0020863 0.0055111 -0.0162748 -0.045115 -0.0043271 0.0026054 -0.0041066 -0.0171948 1.7214506 -0.0770157 -0.0249309 0.2037982 0.5287448 0.0658327 0.019041 0.0673875 0.108963 0.1240121 0.0986411 0.0123033 -0.1755731 0.014874 0.0231788 -0.0300042 0.0210719 -0.1305472 0.0557828 -0.1178944 -0.0188836 0.1714275 -0.0098121 0.0136364 0.0254982 0.0162402 -0.1093548 -1.1587297 -0.3162964 -0.0405511 -0.4967324 -0.3922888 -0.0481369 -0.0685152 -0.0496217 -0.0627762 -0.1895666 -0.1468915 -0.0215311 -0.2688532 0.0496597 0.0315509 -0.0394206 0.0305558 -0.1434224 -0.1387454 0.1707707 0.0253391 0.2362999 0.0831056 0.03267 0.0350497 0.0333322 -0.1440264 0.1147362 -0.0025738 -0.0024723 0.0405752 0.0146987 0.0219543 0.0039228 0.0221527 -0.1313159 1.392686 0.4995468 0.0667339 0.504715 1.4753608 0.2190988 0.0680369 0.2190974 0.074089 1.2079388 -0.5420108 -0.0936128 -0.7481995 1.737115 0.2693154 -0.1265872 0.267465 0.0898736 0.0647665 -0.105797 -0.0149773 -0.0881044 -0.0373965 -0.0263423 -0.0122588 -0.0263969 0.1416585 0.1441446 0.0629349 0.0092523 0.0576339 0.0329534 -0.0183767 0.0082303 -0.0186611 0.1510055 0.113202 0.0726516 0.0117065 0.0748233 0.0184306 -0.022884 0.012165 -0.0227211 0.1574973 0.0119611 0.07569 0.0124644 0.1079915 -0.0507258 -0.0322956 0.0174237 -0.0319699 0.1558379 0.0159565 -0.0744113 -0.0099453 -0.1051158 -0.0538367 -0.0307904 -0.0146301 -0.0310264 0.1539336 -0.1249577 -0.0040966 0.0017187 -0.002627 0.0978092 -0.0091577 0.0018782 -0.0091822 0.1581353 unknown
polarizability: 228.5221941|2.8767674|164.6454804|-0.9801875|17.382961|53.767404 unknown
InChI: InChI=1S/C10H6Cl2N2/c11-9-6-8(13-10(12)14-9)7-4-2-1-3-5-7/h1-6H
charge 0 multiplicity 1
20 atoms
Cl 3.472843 2.537801 0.328783
Cl 2.998609 -2.757964 -0.491194
N  0.858772 -1.151628 -0.223646
N  3.03858 -0.101258 -0.077848
C  -1.250444 0.067984 -0.017806
C  0.233287 0.066679 -0.029509
C  -2.000018 1.263149 0.166193
C  -1.946609 -1.159925 -0.195223
C  1.020171 1.239648 0.146823
C  -3.408838 1.229103 0.172585
C  -3.354996 -1.190783 -0.18838
C  -4.092464 0.002827 -0.004425
C  2.417741 1.078181 0.110652
C  2.198489 -1.155584 -0.234946
H  -1.49716 2.225967 0.304893
H  -1.359987 -2.072183 -0.335997
H  0.581289 2.224262 0.3039
H  -3.973909 2.156371 0.315033
H  -3.878273 -2.142897 -0.326209
H  -5.187685 -0.020752 0.001021
