program: Gaussian 09
title: 000241550
version: EM64L-G09RevD.01
frameworkgroup: C1[X(C9H17N3O5)]
method: RPBEPBE
basis: SDD
operation: Freq
keyword: #p
keyword: freq=noraman
keyword: PBEPBE/SDD
title: #p freq=noraman PBEPBE/SDD
converged: YES YES NO NO
title: Mulliken charges:
elementType: O O O O O N N N C C C C C C C C C H H H H H H H H H H H H H H H H H
charge: -0.310715 -0.286933 -0.436286 -0.481029 -0.332896 -0.378124 -0.371241 -0.333786 -0.339569 0.255290 0.217711 -0.379534 -0.372186 -0.304405 -0.316380 0.288459 -0.760803 0.295749 0.364726 0.371592 0.330232 0.236274 0.242322 0.230343 0.241326 0.214737 0.224925 0.217711 0.215201 0.228950 0.256359 0.258154 0.338355 0.375472
chargesum: 0.00000
title: Mulliken charges with hydrogens summed into heavy atoms:
elementType: O O O O O N N N C C C C C C C C C
charge: -0.310715 -0.286933 -0.097930 -0.105557 -0.332896 -0.013398 0.000351 -0.003555 -0.043820 0.255290 0.217711 0.099062 0.099483 0.135257 0.116532 0.288459 -0.017341
polarizability: 1.66276888e+02 -6.48653882e+00 1.46925638e+02 -2.28168192e-01 -3.00445105e+00 9.69545640e+01
1716.lowfreq: -11.9916 -0.0007 -0.0005 0.0001 1.8482 4.1567 24.9172 29.4309 57.2489
frequency: 24.5409 28.5702 57.1808 59.3966 64.6783 72.5995 89.4394 97.4117 110.5952 137.1349 151.4440 166.2426 182.6142 232.6325 239.3651 285.6793 293.1344 303.3446 338.5431 345.8575 368.8773 391.1298 476.1343 485.7754 512.7613 541.2488 577.7459 596.1883 624.8362 667.8632 707.3330 725.5540 767.9760 774.9732 823.0480 852.0222 855.0758 872.1275 909.4140 924.7275 942.0782 969.0844 995.4753 1011.3840 1013.4757 1048.8607 1057.1726 1068.6708 1088.0916 1092.1988 1133.6619 1174.5852 1188.7022 1202.5836 1236.2193 1250.6685 1265.2235 1274.3687 1277.9023 1323.8992 1330.2590 1336.4398 1354.5275 1356.6968 1375.1657 1389.6604 1393.5617 1432.7450 1442.6058 1449.4465 1460.7539 1465.6033 1466.1825 1491.8509 1511.8926 1546.5269 1582.5545 1606.8013 1644.8202 2976.4441 2978.8506 2981.5752 3003.4292 3018.0694 3031.1481 3071.9636 3085.7177 3090.7355 3099.3333 3103.6620 3111.7097 3117.3101 3371.6023 3388.0017 3527.8437 3557.1922
redmass: 5.5817 5.5196 5.0814 4.6538 2.0000 2.3047 2.7192 4.0883 4.4239 4.8744 3.5322 3.5720 3.3768 4.5324 4.2425 3.8236 6.6155 4.4090 1.5179 2.6425 3.1060 2.7374 2.6620 4.4438 2.7845 2.6760 1.5561 3.4152 4.7419 4.1137 1.4657 2.0937 3.8940 1.2058 2.2909 3.2988 2.9236 3.0605 3.2348 1.9222 1.4174 2.6959 1.6521 3.2542 3.1099 1.6495 3.4861 2.5499 1.9316 2.5205 4.4850 1.2559 1.4326 1.2140 1.5035 1.8215 1.4629 1.3461 1.9845 1.5200 1.1600 1.2768 1.3166 1.2613 1.2082 1.1542 1.2321 1.1107 1.1156 1.0483 1.1743 1.0837 1.0877 2.4188 1.7667 2.3094 3.1888 4.7376 5.7565 1.0819 1.0647 1.0671 1.0360 1.0589 1.0601 1.0990 1.1011 1.1024 1.0976 1.1063 1.0991 1.0918 1.0780 1.0680 1.0770 1.0661
irintensity: 0.5376 1.3978 0.5986 6.1961 1.3931 0.3033 9.3137 6.3652 9.2487 6.8490 6.1552 7.1054 23.1360 5.6199 13.1877 8.8261 8.7583 4.5757 103.0745 48.6093 31.4628 22.0016 20.7120 20.5615 10.2718 19.6821 214.8516 20.5666 6.8599 4.2701 24.7977 31.2069 10.1175 86.5008 17.8438 3.8897 23.2390 9.0230 2.5027 27.6867 88.1490 42.4254 5.6378 86.3493 69.1040 18.7312 11.9780 4.7794 1.4637 1.1052 1.1348 29.8788 11.8306 11.2005 9.8136 57.1106 41.0018 0.6707 6.2241 7.1180 12.2449 1.1315 2.3310 7.5746 31.0601 40.7417 53.9761 26.6994 31.0944 23.1123 128.9704 8.4918 6.0991 337.0403 172.1856 309.6778 40.7073 291.7481 208.9093 6.8747 46.6578 38.2355 5.9364 25.2078 24.4287 69.9081 45.1027 27.4445 5.4839 12.6196 143.8329 362.0782 133.8859 420.4518 31.4796 3.3778
temp: 298.150 k
press: 1.00000 atm
elementType: 8 8 8 8 8 7 7 7 6 6 6 6 6 6 6 6 6 1 1 1 1 1 1 1 1 1 1 1 1 1 1 1 1 1
symmnumber: 1
zpe: 720763.2 jmol-1
zpe.correction: 0.274524 hartree
zpe.thermalcorrener: 0.293619 hartree
zpe.thermalcorrenthalpy: 0.294564 hartree
zpe.thermalcorrgfe: 0.224936 hartree
zpe.sumelectzpe: -892.220664 hartree
zpe.sumelectthermal: -892.201569 hartree
zpe.sumelectthermalent: -892.200625 hartree
zpe.sumelectthermalfe: -892.270253 hartree
dipole: -0.3153 3.3047 0.4779
dipole: 3.3539
quadrupole: -115.1183 -106.3700 -98.0591
quadrupole: -3.5269 12.0953 -1.4197
quadrupole: -8.6025 0.1458 8.4567 -3.5269 12.0953 -1.4197
hfenergy: -892.4951886 hartree
pointgroup: C01 [X(C9H17N3O5)]
dipole: -1.1899985 -0.5393375 -0.1848862 debye
polarizability: 156.6435134|-11.0832466|154.2053992|3.4949972|-12.0192715|99.3081777 unknown
InChI: InChI=1S/C9H17N3O5/c1-6(15)12-7(8(16)10-2-4-13)9(17)11-3-5-14/h7,10-14H,2-5H2,1H3
charge 0 multiplicity 1
34 atoms
O  1.623419 0.273058 0.725516
O  -0.641542 -2.741678 0.571154
O  1.236258 4.169545 -1.694769
O  3.562356 -1.79752 1.035664
O  -2.44103 1.487427 -1.012693
N  -1.816167 -0.471019 0.060595
N  0.090958 1.850884 -0.031065
N  1.299455 -2.266455 -0.63469
C  -0.441745 -0.519301 -0.454089
C  0.52266 0.56966 0.150292
C  0.07148 -1.950732 -0.128752
C  0.851351 3.005742 0.487574
C  2.080816 -3.41504 -0.129066
C  1.87678 3.542286 -0.532111
C  2.784367 -3.022403 1.19708
C  -2.752676 0.45795 -0.310064
C  -4.17664 0.214634 0.156866
H  -0.459084 -0.35698 -1.552066
H  -2.055955 -1.317095 0.60455
H  -0.835603 1.976291 -0.5015
H  1.850241 -1.511865 -1.052627
H  1.379352 2.694737 1.407001
H  0.131547 3.806092 0.733138
H  2.83193 -3.676077 -0.894086
H  1.402021 -4.271015 0.024021
H  2.565591 2.727589 -0.835596
H  2.466721 4.349606 -0.068096
H  3.49955 -3.812974 1.482297
H  2.025329 -2.922721 1.99984
H  -4.279858 -0.689222 0.779401
H  -4.528702 1.091076 0.726767
H  -4.831251 0.117041 -0.726659
H  0.704024 3.487608 -2.178275
H  2.941348 -1.013031 1.044748
