program: Gaussian 09
title: 000242037
version: EM64L-G09RevD.01
frameworkgroup: C1[X(C15H18O2)]
method: RPBEPBE
basis: SDD
operation: Freq
keyword: #pfreq=noraman
keyword: PBEPBE/SDD
title: #p freq=noraman PBEPBE/SDD
converged: NO YES NO NO
title: Mulliken charges:
elementType: O O C C C C C C C C C C C C C C C H H H H H H H H H H H H H H H H H H
charge: -0.270254 -0.249131 -0.077924 -0.452527 -0.365658 -0.433449 -0.220043 -0.438486 -0.208509 0.439966 0.214219 -0.436509 -0.370985 -0.231532 -0.247274 -0.242356 -0.509197 0.226981 0.224831 0.242994 0.248880 0.201640 0.207551 0.217108 0.210172 0.215323 0.200470 0.230700 0.277924 0.224334 0.225169 0.227525 0.242622 0.232487 0.242939
chargesum: 0.00000
title: Mulliken charges with hydrogens summed into heavy atoms:
elementType: O O C C C C C C C C C C C C C C C
charge: -0.270254 -0.249131 0.149057 0.015298 -0.116778 -0.024258 -0.002935 -0.012991 -0.008040 0.439966 0.214219 -0.205808 -0.093061 -0.007198 -0.022105 -0.014831 0.208851
polarizability: 2.00300024e+02 1.25922488e+01 1.37187145e+02 6.46938349e-01 -4.90499810e+00 1.43647629e+02
1716.lowfreq: -10.3396 -6.6248 -0.0007 -0.0004 -0.0001 8.1928 33.3294 38.1210 46.5652
frequency: 33.3244 38.0047 46.5243 58.2354 84.8512 92.2548 122.5545 144.0985 194.8154 219.4165 250.3287 254.2571 263.1068 289.9666 335.9714 343.0305 405.0782 447.9943 458.4116 518.0361 543.2925 606.5267 616.4582 660.3056 699.6174 707.8741 720.9383 730.6104 772.7461 794.4277 832.9912 849.4079 858.8549 864.9262 900.9688 926.3883 937.0732 946.2654 967.5248 976.1272 982.4184 990.4611 1000.2647 1029.4871 1036.6646 1061.6218 1080.5451 1086.1845 1089.1739 1111.3836 1114.4699 1135.2493 1147.8349 1172.0043 1179.0434 1193.2986 1200.3981 1227.0389 1236.5688 1246.1972 1271.6855 1309.8466 1324.4905 1334.8904 1340.4881 1347.3984 1360.2851 1385.8879 1388.3970 1420.3594 1442.5971 1451.7216 1455.7295 1463.3646 1468.3540 1479.4523 1482.1656 1590.7769 1611.8056 1635.6662 1669.7105 2927.8112 2956.2320 2976.1457 2998.3911 3005.4390 3007.3758 3022.1987 3041.7767 3062.3862 3081.8476 3107.9103 3112.7089 3115.6015 3125.5973 3139.0080 3148.9912 3154.0244 3164.7380
redmass: 4.0517 3.9431 3.2498 4.0712 2.1694 1.4112 4.1582 3.5217 3.8647 4.0167 3.7834 3.0707 2.5396 4.3842 3.4354 4.5947 2.8694 2.3306 4.0973 3.8595 3.1231 5.3172 6.1773 2.0317 5.4698 2.0028 1.6016 2.7846 2.2296 2.5913 5.1644 2.4901 1.2713 2.5824 2.2013 1.5598 2.3807 2.5354 3.2241 1.2820 1.3653 6.2436 1.3169 2.1931 3.5316 1.8719 1.7381 1.8145 2.0170 1.4425 2.2294 1.1715 1.4492 1.0585 1.2471 1.1175 2.6436 1.1764 1.2988 1.2939 1.2584 1.5293 1.2828 1.4615 1.5601 1.4655 1.6831 4.1796 1.5503 1.2075 2.1201 1.0503 1.0884 1.0507 1.0905 1.0867 2.2535 6.0230 5.9777 8.4675 6.8913 1.0820 1.0624 1.0651 1.0609 1.0295 1.0934 1.0837 1.0995 1.1032 1.0837 1.1045 1.0872 1.0985 1.0866 1.0926 1.1049 1.0954 1.1004
irintensity: 1.2220 0.8511 0.0586 0.5262 0.2340 0.6438 0.6772 1.4023 2.8340 5.3698 5.5082 0.2679 5.0324 0.8100 5.9238 5.7587 0.0444 3.1392 0.3115 16.6342 2.6789 3.7780 1.3343 35.8009 8.3347 48.0675 12.8693 28.3046 7.1010 17.3576 1.4266 9.1984 1.0587 9.4483 6.5673 2.7068 10.7148 4.2050 7.0881 1.1189 0.4073 0.7495 0.4468 12.5534 5.7761 4.2605 37.3017 21.1215 33.8172 50.4546 184.5656 4.8179 13.0899 0.1860 8.7063 0.9375 2.5007 1.5346 8.1629 9.1913 2.3598 11.4542 16.1874 0.8812 3.9720 4.0481 23.1635 2.7602 0.8581 21.8696 9.5359 13.4616 12.1909 11.3085 9.1173 5.7536 28.4946 2.3534 11.6036 111.2333 3.9573 21.5669 40.2650 30.0183 17.6283 36.9821 49.8610 9.8511 51.5531 31.5930 6.4804 23.8303 8.0275 52.8742 1.4539 29.0308 16.5875 18.0019 23.1386
temp: 298.150 k
press: 1.00000 atm
elementType: 8 8 6 6 6 6 6 6 6 6 6 6 6 6 6 6 6 1 1 1 1 1 1 1 1 1 1 1 1 1 1 1 1 1 1
symmnumber: 1
zpe: 766908.9 jmol-1
zpe.correction: 0.292100 hartree
zpe.thermalcorrener: 0.308333 hartree
zpe.thermalcorrenthalpy: 0.309277 hartree
zpe.thermalcorrgfe: 0.246806 hartree
zpe.sumelectzpe: -731.566875 hartree
zpe.sumelectthermal: -731.550642 hartree
zpe.sumelectthermalent: -731.549698 hartree
zpe.sumelectthermalfe: -731.612169 hartree
dipole: 0.6000 0.2209 -1.0054
dipole: 1.1915
quadrupole: -92.8233 -94.2482 -100.2748
quadrupole: 4.8373 0.2597 -0.8820
quadrupole: 2.9588 1.5339 -4.4927 4.8373 0.2597 -0.8820
hfenergy: -731.8589753 hartree
pointgroup: C01 [X(C15H18O2)]
dipole: -0.2089774 -0.1041294 -0.4065002 debye
polarizability: 191.5419694|25.229061|145.1475793|0.5513872|4.8447519|144.4452488 unknown
InChI: InChI=1S/C15H18O2/c1-17-15(16)14(12-8-4-2-5-9-12)13-10-6-3-7-11-13/h2,4-6,8-10,13-14H,3,7,11H2,1H3
charge 0 multiplicity 1
35 atoms
O  -0.191843 -2.746931 -0.699039
O  -0.166995 -1.792739 1.419166
C  -0.990539 0.60145 -0.53499
C  -1.256337 1.202319 0.867111
C  0.243843 -0.389179 -0.605023
C  -2.589673 1.986811 0.872342
C  -2.23937 -0.069353 -1.094456
C  -3.785663 1.052955 0.570239
C  -3.487238 0.120558 -0.590316
C  1.552127 0.296458 -0.198023
C  -0.044378 -1.665244 0.177667
C  2.306478 0.951238 -1.206323
C  2.020134 0.343578 1.140386
C  3.49727 1.64192 -0.890128
C  3.215258 1.028567 1.456233
C  3.957338 1.682568 0.446268
C  -0.517697 -4.046662 -0.06192
H  -0.704405 1.43519 -1.21568
H  -0.419891 1.863425 1.15763
H  -1.304319 0.388331 1.614592
H  0.331625 -0.695942 -1.663712
H  -2.548106 2.78566 0.104651
H  -2.733847 2.485846 1.849347
H  -2.097997 -0.742276 -1.953132
H  -4.693108 1.648763 0.345242
H  -4.035109 0.450326 1.469582
H  -4.335744 -0.415275 -1.039674
H  1.961659 0.913209 -2.247677
H  1.452057 -0.163632 1.926826
H  4.06679 2.138922 -1.683655
H  3.566104 1.051633 2.49434
H  4.883116 2.213219 0.695559
H  0.281028 -4.337039 0.64092
H  -0.59127 -4.757827 -0.896414
H  -1.471896 -3.972746 0.486058
