program: Gaussian 09
title: 000242046
version: EM64L-G09RevD.01
frameworkgroup: C1[X(C22H18O4)]
method: RPBEPBE
basis: SDD
operation: Freq
keyword: #pfreq=noraman
keyword: PBEPBE/SDD
title: #p freq=noraman PBEPBE/SDD
converged: YES YES NO NO
title: Mulliken charges:
elementType: O O O O C C C C C C C C C C C C C C C C C C C C C C H H H H H H H H H H H H H H H H H H
charge: -0.248364 -0.258553 -0.208050 -0.265881 -0.054625 0.270364 0.307522 0.480210 0.065353 0.063213 -0.360049 0.256187 -0.347845 -0.393262 -0.407095 -0.376176 -0.235403 -0.525995 -0.221155 -0.422441 0.342008 -0.222843 -0.241488 -0.250794 -0.534506 -0.535450 0.255884 0.250131 0.264522 0.244283 0.268763 0.232659 0.265358 0.235400 0.243407 0.224921 0.223881 0.226755 0.218729 0.227344 0.251032 0.245834 0.221303 0.224912
chargesum: 0.00000
title: Mulliken charges with hydrogens summed into heavy atoms:
elementType: O O O O C C C C C C C C C C C C C C C C C C C C C C
charge: -0.248364 -0.258553 -0.208050 -0.265881 -0.054625 0.270364 0.307522 0.480210 0.065353 0.063213 -0.104165 0.256187 -0.097714 -0.128741 -0.162811 -0.107413 -0.002744 -0.260637 0.014244 -0.179035 0.342008 0.002078 -0.017607 -0.024039 0.162600 0.156599
polarizability: 2.68973207e+02 1.53358272e+00 2.62318458e+02 -1.66063983e+01 7.84381993e+00 2.15644648e+02
1716.lowfreq: -6.1954 -0.0009 -0.0007 -0.0005 2.4585 7.5628 30.3550 36.4470 47.6402
frequency: 30.2157 36.4412 47.5610 53.7573 63.7754 71.8314 91.2233 99.7294 137.8427 145.3012 151.4974 178.4677 201.5288 217.1742 231.4537 239.5327 261.9642 267.6208 273.4257 292.7060 298.5488 325.4589 391.3803 405.3383 416.0653 421.1033 465.6534 479.8746 491.4377 515.3174 518.5812 560.6416 571.0679 581.4689 615.7097 624.9132 645.6049 651.0722 665.4707 698.7215 705.8060 711.1170 733.3661 752.2766 770.2224 776.0707 787.3032 797.7271 847.6001 857.0953 862.9745 865.6371 889.9698 914.4594 921.2541 939.9120 948.2183 969.6972 982.3129 986.7683 989.4834 996.1170 1000.1721 1001.0001 1016.9901 1027.1559 1031.5659 1083.1294 1089.8752 1110.7571 1112.3173 1124.5757 1144.8216 1158.7512 1161.2669 1171.5460 1173.5035 1183.4886 1188.6791 1201.4692 1217.0297 1237.7561 1263.1128 1277.0314 1282.9633 1314.7367 1378.9805 1384.2443 1400.8813 1413.0847 1433.6841 1434.9017 1448.5716 1449.6918 1459.4527 1466.7940 1468.1116 1469.5662 1474.5144 1480.2813 1497.3437 1578.2155 1592.8615 1604.1158 1610.6278 1617.6477 1620.6748 1690.4457 2963.2461 2963.8751 3052.6744 3054.3925 3117.7188 3126.7514 3128.1409 3132.2060 3133.1110 3140.5579 3146.4756 3149.7398 3156.8762 3157.3895 3170.3148 3171.6919 3175.8494 3181.2387
redmass: 4.3773 5.1116 4.7007 4.1376 5.5359 4.8120 3.5514 3.5031 4.8412 4.8936 4.3679 4.1196 1.7048 5.1194 1.6192 2.7945 4.5257 2.2607 3.1964 4.3089 6.0427 6.0562 5.5129 2.8900 3.3294 4.3168 3.4090 4.2568 5.2509 5.2190 6.8560 7.6255 4.7510 4.8380 6.4365 4.7738 5.4400 5.0158 4.9299 6.4003 1.8425 6.1696 3.5815 2.2962 2.1732 3.0960 1.8913 1.7816 1.7548 1.3891 4.7119 4.4533 1.5909 2.6449 3.2077 2.0608 1.6832 1.4102 1.3876 8.5043 5.2050 1.4290 4.2717 1.3847 3.3948 2.3063 2.2134 1.8804 2.1346 1.2599 1.2593 2.0860 1.4741 1.3725 1.7588 1.0521 1.1758 1.7086 1.1834 3.2135 2.6745 3.7976 4.9714 1.5114 1.4481 1.3370 7.7269 6.5484 8.6135 2.3698 1.2037 2.1609 1.7182 2.0836 2.5037 1.0502 1.1258 1.0500 1.0673 2.2563 2.5329 7.4976 6.3322 7.5398 6.2497 7.1121 6.7754 12.9601 1.0327 1.0328 1.1041 1.1040 1.0855 1.0998 1.0877 1.0997 1.0860 1.0933 1.0897 1.0881 1.0973 1.0955 1.1003 1.0973 1.0942 1.0911
irintensity: 0.0429 1.5416 0.1840 1.1811 2.3799 2.3153 6.1259 1.7646 1.6335 0.2433 0.3126 2.9445 2.0038 0.1807 0.3813 1.2173 1.5169 1.1113 0.5893 6.2902 3.4623 1.1569 1.1588 0.2022 0.4629 4.5157 4.3022 3.4030 0.8046 6.7922 6.0098 1.7328 28.5115 23.3223 0.0694 2.2848 10.8177 5.1504 25.6009 0.3030 47.4375 0.4148 2.8205 27.6636 50.8456 14.7011 29.2158 41.7485 38.6848 11.7190 124.8893 17.1117 3.0268 42.2253 7.7806 6.3241 3.7931 0.9385 3.5213 42.8763 1.8384 6.7665 93.9719 6.1074 67.6634 26.0610 19.3561 5.6429 31.9423 0.1227 0.2531 97.6754 12.6261 9.6142 79.1329 0.2903 12.2154 66.3679 17.1539 29.7220 18.6925 35.1121 174.6205 12.8409 1.6759 3.2816 12.0312 27.9260 4.9926 23.3660 16.8189 7.7950 35.7275 7.4359 10.2778 13.1348 69.5022 11.9770 38.1439 16.8972 63.0363 99.7559 1.7359 5.7203 11.5724 12.3596 223.6431 401.4147 71.1923 60.4573 40.1565 39.7490 4.8821 26.1317 2.9570 14.5996 1.8712 29.5145 9.9795 2.0855 22.6273 18.8450 22.0909 11.3220 10.6361 1.9088
temp: 298.150 k
press: 1.00000 atm
elementType: 8 8 8 8 6 6 6 6 6 6 6 6 6 6 6 6 6 6 6 6 6 6 6 6 6 6 1 1 1 1 1 1 1 1 1 1 1 1 1 1 1 1 1 1
symmnumber: 1
zpe: 891890.8 jmol-1
zpe.correction: 0.339703 hartree
zpe.thermalcorrener: 0.362084 hartree
zpe.thermalcorrenthalpy: 0.363028 hartree
zpe.thermalcorrgfe: 0.287660 hartree
zpe.sumelectzpe: -1148.199637 hartree
zpe.sumelectthermal: -1148.177256 hartree
zpe.sumelectthermalent: -1148.176312 hartree
zpe.sumelectthermalfe: -1148.251680 hartree
dipole: 2.5567 -0.5247 -5.3805
dipole: 5.9801
quadrupole: -133.1259 -128.3423 -157.0990
quadrupole: -2.1094 5.7277 12.7937
quadrupole: 6.3965 11.1801 -17.5766 -2.1094 5.7277 12.7937
hfenergy: -1148.53934 hartree
pointgroup: C01 [X(C22H18O4)]
dipole: -0.941629 0.1337627 -2.1519548 debye
polarizability: 268.425629|2.3907477|260.7268215|17.0470521|-11.9631432|217.7838625 unknown
InChI: InChI=1S/C22H18O4/c1-24-16-12-13-19(20(14-16)25-2)22(15-8-4-3-5-9-15)18-11-7-6-10-17(18)21(23)26-22/h3-14H,1-2H3
charge 0 multiplicity 1
44 atoms
O  0.79957 0.127399 1.746269
O  -1.430004 -1.781559 1.228977
O  2.006141 1.563486 3.139584
O  -5.110338 0.903314 -0.39281
C  0.551828 -0.042619 0.248199
C  1.48462 1.01585 -0.359927
C  -0.935223 0.22562 0.014018
C  1.019696 -1.445486 -0.178616
C  2.123523 1.735723 0.668692
C  1.691168 1.208802 1.988837
C  1.777368 1.295191 -1.707729
C  -1.920772 -0.669761 0.549543
C  -1.398188 1.376734 -0.654571
C  1.960267 -2.171181 0.587963
C  0.568503 -1.978854 -1.410741
C  3.052888 2.76092 0.400365
C  2.707733 2.32345 -1.992497
C  -3.295815 -0.409277 0.390343
C  3.338427 3.055012 -0.950983
C  -2.772523 1.657948 -0.827842
C  -3.719785 0.752553 -0.299113
C  2.441356 -3.417072 0.128169
C  1.050826 -3.223714 -1.87005
C  1.992743 -3.947513 -1.103326
C  -2.387559 -2.709033 1.834422
C  -5.615921 2.099346 -1.072328
H  1.311852 0.725109 -2.518065
H  -0.668626 2.087469 -1.054348
H  2.287885 -1.774216 1.553044
H  -0.179861 -1.433194 -1.998164
H  3.533401 3.296914 1.225241
H  2.951089 2.55525 -3.035424
H  -4.063266 -1.074984 0.791804
H  4.055969 3.843501 -1.20182
H  -3.077362 2.565072 -1.355426
H  3.16409 -3.975372 0.734038
H  0.689331 -3.629774 -2.821784
H  2.367491 -4.914305 -1.458001
H  -3.041411 -3.169738 1.068716
H  -3.005217 -2.199756 2.598653
H  -1.767434 -3.482326 2.309782
H  -6.711368 2.015238 -1.023583
H  -5.289905 2.128434 -2.130051
H  -5.288085 3.022202 -0.556266
