program: Gaussian 09
title: 000241515
version: EM64L-G09RevD.01
frameworkgroup: C1[X(C13H11NO2S)]
method: RPBEPBE
basis: SDD
operation: Freq
keyword: #p
keyword: freq=noraman
keyword: PBEPBE/SDD
title: #p freq=noraman PBEPBE/SDD
converged: YES YES NO NO
title: Mulliken charges:
elementType: S O O N C C C C C C C C C C C C C H H H H H H H H H H H
charge: 0.264418 -0.217567 -0.217713 0.021802 -0.370973 0.472185 -0.213458 -0.225882 -0.397918 -0.811558 -0.116747 -0.210053 0.376630 -0.231224 -0.215944 -0.372929 -0.342741 0.263147 0.240028 0.270620 0.252569 0.249696 0.255900 0.228086 0.238576 0.234181 0.287972 0.288898
chargesum: 0.00000
title: Mulliken charges with hydrogens summed into heavy atoms:
elementType: S O O N C C C C C C C C C C C C C
charge: 0.264418 -0.217567 -0.217713 0.021802 -0.370973 0.472185 -0.213458 0.037265 -0.157890 -0.077877 0.153873 0.042516 0.376630 0.007352 0.018238 -0.084958 -0.053843
polarizability: 2.81181864e+02 -9.23484020e+00 1.61842024e+02 -1.31167242e+01 2.49991115e-01 1.18851570e+02
1716.lowfreq: -11.3805 -3.5095 0.0016 0.0020 0.0020 6.9665 22.1403 31.8147 50.1065
frequency: 21.8685 31.8022 50.1049 74.5127 86.8032 132.0499 147.1578 176.5976 231.4663 245.1044 267.4484 276.2945 335.1678 372.1675 410.5441 429.7461 459.4102 472.2274 498.9228 507.6077 532.3439 543.2708 621.8816 661.2206 662.9784 687.3488 717.1262 724.1295 764.4213 787.7116 794.4938 840.9267 853.5684 876.8752 955.2090 984.0068 986.2560 993.6802 995.3275 997.8929 1022.1616 1042.6457 1048.3302 1067.8356 1095.6940 1110.5246 1130.2023 1175.0562 1179.2045 1215.7523 1223.5270 1276.0960 1289.5257 1350.6922 1364.0210 1390.3683 1403.1798 1417.5043 1420.0499 1458.7943 1461.0743 1463.3347 1474.6241 1575.1028 1583.0685 1591.2337 1600.2756 2983.5400 3062.4887 3094.6990 3127.3950 3141.4851 3147.3957 3153.3625 3154.0000 3170.4351 3181.7456 3184.5076
redmass: 4.9545 4.7494 6.7226 6.3018 7.6218 1.2801 2.5566 5.3489 4.9864 4.2471 6.9502 6.3049 8.9009 3.7805 2.9607 4.0341 3.5348 3.4497 7.0892 6.6717 4.8265 5.4245 7.1730 6.1826 5.3561 8.7559 3.3180 4.5628 1.2490 9.1991 4.7928 1.2904 1.4934 1.2861 1.3683 1.3315 1.5696 1.3509 1.3351 3.6463 5.1679 2.2026 1.5535 4.0362 2.9647 1.2945 1.5307 1.0603 1.3948 2.4102 4.7501 1.4719 1.2609 6.4968 7.7927 8.0329 1.2361 4.6101 2.0095 2.1065 2.0348 1.1614 1.1578 5.8339 8.0036 6.3632 6.4970 1.0377 1.0961 1.0998 1.0868 1.0893 1.0904 1.0933 1.0905 1.1007 1.0949 1.0958
irintensity: 0.3220 0.1878 0.6704 0.2253 2.2216 0.3581 1.0659 1.1295 1.4227 5.7624 1.5699 0.4485 0.6939 0.0938 0.4481 8.0315 7.3571 11.3119 10.0057 1.0484 7.5871 1.2027 1.3539 12.7416 14.8205 0.8535 7.8320 8.7494 68.6004 39.8423 1.2509 10.9709 43.9709 0.4001 0.5540 3.9578 1.6432 1.1401 0.0474 18.6782 53.1701 3.1003 11.6774 60.2745 7.5951 13.0259 3.7649 3.1425 119.2384 28.9311 469.1057 2.0536 0.5602 60.7651 3.3495 56.5213 15.3063 23.0629 1.6988 35.2360 18.2095 16.7831 25.8716 5.5093 2.1719 200.9104 8.6912 14.7518 11.8019 20.3929 4.3733 7.7640 3.4422 16.1993 3.2552 21.5120 0.1192 2.4300
temp: 298.150 k
press: 1.00000 atm
elementType: 16 8 8 7 6 6 6 6 6 6 6 6 6 6 6 6 6 1 1 1 1 1 1 1 1 1 1 1
symmnumber: 1
zpe: 544531.8 jmol-1
zpe.correction: 0.207401 hartree
zpe.thermalcorrener: 0.222639 hartree
zpe.thermalcorrenthalpy: 0.223583 hartree
zpe.thermalcorrgfe: 0.162697 hartree
zpe.sumelectzpe: -1103.965104 hartree
zpe.sumelectthermal: -1103.949866 hartree
zpe.sumelectthermalent: -1103.948922 hartree
zpe.sumelectthermalfe: -1104.009808 hartree
dipole: 6.5614 0.7117 0.3079
dipole: 6.6071
quadrupole: -129.3714 -104.8032 -100.2573
quadrupole: -17.3652 -0.5001 -0.0060
quadrupole: -17.8941 6.6741 11.2200 -17.3652 -0.5001 -0.0060
hfenergy: -1104.1725047 hartree
pointgroup: C01 [X(C13H11N1O2S1)]
dipole: -2.5699213 0.0767852 -0.382917 debye
polarizability: 271.5609686|-36.4949983|147.3404849|19.2716652|17.2315899|142.9740049 unknown
InChI: InChI=1S/C13H11NO2S/c1-10-4-2-3-5-13(10)17-12-8-6-11(7-9-12)14(15)16/h2-9H,1H3
charge 0 multiplicity 1
28 atoms
S  -1.264137 -1.032188 -1.678977
O  4.296745 0.821512 1.830442
O  5.143085 -0.894255 0.583365
N  4.173183 -0.120471 0.951556
C  -2.440617 0.078145 -0.780065
C  -2.971804 -0.296631 0.487381
C  0.33085 -0.71285 -0.838013
C  -2.85133 1.260294 -1.436957
C  -3.924844 0.577151 1.074462
C  -2.548432 -1.565275 1.200379
C  0.513756 0.316043 0.120072
C  1.422748 -1.545308 -1.206994
C  2.849694 -0.324476 0.333297
C  -3.806316 2.108739 -0.83279
C  -4.340612 1.763414 0.428702
C  1.77498 0.511841 0.71075
C  2.686464 -1.3524 -0.624735
H  -2.421223 1.509939 -2.41199
H  -4.348504 0.313067 2.050459
H  -0.323115 0.965478 0.394431
H  1.280243 -2.341794 -1.944922
H  -2.672301 -2.450787 0.551443
H  -1.480008 -1.530793 1.485227
H  -3.139805 -1.717668 2.118542
H  -4.124539 3.024423 -1.341674
H  -5.081875 2.412387 0.907862
H  1.942304 1.29902 1.450665
H  3.541307 -1.978958 -0.891918
