program: Gaussian 09
title: 000242035
version: EM64L-G09RevD.01
frameworkgroup: C1[X(C14H16O2)]
method: RPBEPBE
basis: SDD
operation: Freq
keyword: #pfreq=noraman
keyword: PBEPBE/SDD
title: #p freq=noraman PBEPBE/SDD
converged: YES YES NO NO
title: Mulliken charges:
elementType: O O C C C C C C C C C C C C C C H H H H H H H H H H H H H H H H
charge: -0.213901 -0.190880 -0.143722 -0.098333 -0.482400 -0.440436 -0.431352 -0.408985 -0.376854 0.148767 0.546009 -0.437151 -0.387555 -0.232168 -0.237563 -0.242729 0.260807 0.249952 0.264584 0.228968 0.206969 0.230392 0.218455 0.195577 0.215138 0.197154 0.211668 0.227185 0.240072 0.226016 0.226474 0.229842
chargesum: 0.00000
title: Mulliken charges with hydrogens summed into heavy atoms:
elementType: O O C C C C C C C C C C C C C C
charge: -0.213901 -0.190880 0.117085 0.151619 -0.217816 -0.004499 0.017496 0.001730 0.031969 0.148767 0.546009 -0.209966 -0.147483 -0.006152 -0.011089 -0.012888
polarizability: 1.87171410e+02 2.32933496e+00 1.37224224e+02 -2.57227374e+00 1.20719405e+01 1.10744761e+02
1716.lowfreq: -16.0409 -4.8811 -0.0010 -0.0006 -0.0004 8.2318 37.1391 47.5947 74.4522
frequency: 36.9709 47.0951 74.4508 104.0873 148.7231 164.0011 218.1308 260.4199 298.7659 346.2957 355.1905 390.1109 403.1757 444.0183 451.3067 502.0878 536.1650 558.6457 616.0757 632.6791 646.4745 693.0530 704.4856 756.1434 782.3317 803.8853 838.8172 850.9076 858.7667 867.9951 894.7096 906.4151 922.6017 930.8152 974.4510 979.3252 990.7170 993.1444 996.3035 1027.7726 1042.1197 1062.9049 1072.6279 1083.4955 1111.2674 1121.2954 1145.2688 1173.3133 1187.8048 1192.8040 1206.9933 1210.3745 1244.5407 1245.5557 1277.0114 1280.6617 1310.3283 1318.4797 1326.2148 1333.0516 1338.7241 1345.2562 1356.3186 1362.7111 1383.6344 1442.1039 1464.3310 1468.7692 1471.4856 1478.7525 1486.4958 1593.4826 1615.7190 1699.9588 2969.4346 2972.0187 2974.8826 2976.9357 2989.9322 2996.6597 3030.3655 3039.3008 3045.1074 3046.5534 3067.1138 3112.3038 3124.2272 3135.2146 3146.9341 3164.2227
redmass: 4.0319 4.0287 4.3200 4.7311 3.2394 4.3187 2.9729 5.0900 2.4200 2.0218 4.3697 4.5495 2.8078 5.0569 2.8442 3.8331 3.5113 3.1155 6.4405 3.1301 6.3820 5.2291 1.7341 1.9910 2.0854 2.0071 3.2120 1.2676 2.7695 2.9497 2.7095 1.7338 1.6546 3.2665 1.4011 2.8537 4.4714 2.0929 1.4715 2.3628 2.6143 1.8005 1.6617 1.6148 1.5165 1.4912 2.8144 1.0549 1.3669 1.1206 1.6595 1.4967 1.3656 1.2657 1.6064 1.5037 1.6374 1.3071 1.4863 1.3725 1.3749 1.4575 1.4469 1.4116 7.4374 2.1700 1.0858 1.0905 1.0807 1.0920 2.3322 6.0244 6.0977 12.9126 1.0713 1.0654 1.0609 1.0757 1.0640 1.0832 1.0975 1.0974 1.0948 1.0972 1.0973 1.0879 1.0861 1.0911 1.0960 1.1015
irintensity: 0.3538 0.1172 1.5536 0.8298 1.0538 2.5607 0.2532 2.7575 0.1869 0.2450 3.7413 1.0151 0.1396 0.2661 0.2019 9.5459 12.9646 3.9097 0.3237 9.3456 5.8790 1.3150 48.6816 34.0979 8.9742 7.8725 4.9443 2.0268 4.9923 47.6982 14.4003 12.2748 11.9423 40.4059 0.6135 22.7323 0.9170 12.3015 0.5667 4.6776 115.8084 24.3462 30.8377 8.8825 0.8784 3.4289 5.4346 0.1254 17.3557 1.4562 1.8218 0.2470 8.4919 1.1268 17.5917 2.5269 0.5354 2.7637 0.8787 1.0283 1.8233 0.2405 10.2593 3.5819 0.2870 9.6182 6.0636 5.2819 21.9683 11.9903 20.2176 1.5611 6.1123 302.3161 15.2652 15.1154 44.0727 6.1141 17.0872 42.1105 29.2207 57.9494 47.6631 10.5386 73.0439 11.5019 1.8487 14.5372 35.1759 21.3176
temp: 298.150 k
press: 1.00000 atm
elementType: 8 8 6 6 6 6 6 6 6 6 6 6 6 6 6 6 1 1 1 1 1 1 1 1 1 1 1 1 1 1 1 1
symmnumber: 1
zpe: 701326.1 jmol-1
zpe.correction: 0.267121 hartree
zpe.thermalcorrener: 0.280390 hartree
zpe.thermalcorrenthalpy: 0.281334 hartree
zpe.thermalcorrgfe: 0.226492 hartree
zpe.sumelectzpe: -692.373863 hartree
zpe.sumelectthermal: -692.360594 hartree
zpe.sumelectthermalent: -692.359650 hartree
zpe.sumelectthermalfe: -692.414492 hartree
dipole: 1.5168 -5.1378 1.4766
dipole: 5.5568
quadrupole: -83.8180 -107.9421 -92.5267
quadrupole: -0.9935 -1.9077 7.6784
quadrupole: 10.9443 -13.1798 2.2356 -0.9935 -1.9077 7.6784
hfenergy: -692.6409839 hartree
pointgroup: C01 [X(C14H16O2)]
dipole: 0.6021855 2.0144285 -0.5991548 debye
polarizability: 187.1223563|-2.408309|137.4986298|3.2315836|11.7451996|110.5194093 unknown
InChI: InChI=1S/C14H16O2/c15-14-13(10-6-2-1-3-7-10)11-8-4-5-9-12(11)16-14/h1-3,6-7,11-13H,4-5,8-9H2
charge 0 multiplicity 1
32 atoms
O  1.719839 -2.031558 -0.177043
O  -0.177342 -2.728027 0.961692
C  1.053422 0.198619 -0.783267
C  2.297433 -0.716558 -0.63061
C  0.13548 -0.293372 0.380833
C  1.381072 1.708353 -0.812751
C  3.323917 -0.228841 0.409196
C  2.410437 2.136576 0.260261
C  3.681922 1.260354 0.184548
C  0.472812 -1.802327 0.455143
C  -1.337692 0.028738 0.204025
C  -1.91002 1.126778 0.893872
C  -2.151715 -0.714889 -0.688884
C  -3.262265 1.484061 0.692092
C  -3.502968 -0.361478 -0.89139
C  -4.063077 0.741366 -0.204715
H  0.539006 -0.07215 -1.727018
H  2.784488 -0.925693 -1.598123
H  0.485123 0.152873 1.334437
H  0.441309 2.284528 -0.710449
H  1.792967 1.957799 -1.811769
H  4.222722 -0.869814 0.365236
H  2.898076 -0.349505 1.424796
H  1.970973 2.051302 1.275381
H  2.666788 3.203375 0.117916
H  4.163125 1.390259 -0.806882
H  4.421576 1.581024 0.941791
H  -1.295816 1.701292 1.599294
H  -1.736084 -1.585498 -1.20987
H  -3.690079 2.333377 1.236503
H  -4.122721 -0.950094 -1.577068
H  -5.113208 1.012331 -0.360677
