program: Gaussian 09
title: 000241502
version: EM64L-G09RevD.01
frameworkgroup: C1[X(C9H18N2)]
method: RPBEPBE
basis: SDD
operation: Freq
keyword: #pfreq=noraman
keyword: PBEPBE/SDD
title: #p freq=noraman PBEPBE/SDD
converged: YES YES NO NO
title: Mulliken charges:
elementType: N N C C C C C C C C C H H H H H H H H H H H H H H H H H H
charge: -0.346365 -0.344515 -0.049510 -0.009706 -0.516524 -0.014957 -0.498156 -0.420246 -0.391133 -0.391301 -0.750293 0.219712 0.196043 0.222312 0.179973 0.190573 0.223493 0.184252 0.200087 0.191455 0.249321 0.248157 0.190640 0.198389 0.190666 0.198361 0.212920 0.212292 0.224059
chargesum: 0.00000
title: Mulliken charges with hydrogens summed into heavy atoms:
elementType: N N C C C C C C C C C
charge: -0.097044 -0.096358 0.170202 0.186336 -0.114240 0.175616 -0.090411 -0.028704 -0.002104 -0.002274 -0.101021
polarizability: 1.24744344e+02 6.29593645e-01 1.04559741e+02 -7.45783879e-01 4.02079110e-01 8.88087207e+01
1716.lowfreq: -0.0005 0.0000 0.0006 6.8631 19.8696 26.9905 104.2129 121.8059 189.8215
frequency: 104.2111 121.7999 189.8098 208.6329 239.0188 288.5867 338.4932 350.2613 371.5410 382.6026 428.7932 436.0896 456.0926 507.3176 538.9638 628.5614 672.6434 722.2845 761.6467 794.3278 854.3849 871.5511 899.8159 919.5878 949.5126 968.9099 986.6711 1013.8109 1035.0051 1051.4337 1073.5522 1082.3523 1085.3905 1140.4966 1144.8550 1153.9961 1161.2613 1171.0012 1187.4731 1222.8928 1236.7076 1255.7657 1281.4156 1286.3596 1300.8223 1319.1497 1330.8798 1332.3568 1341.3437 1347.1524 1354.7275 1370.2618 1387.6504 1391.4374 1426.5771 1453.6491 1458.5789 1461.2591 1462.2233 1463.7135 1475.2566 1479.9659 1489.7910 2836.9660 2866.6560 2875.4378 2889.6081 2956.4744 2963.4388 2972.2825 2973.8728 2984.6407 3021.6828 3024.3047 3034.0894 3037.8325 3039.3993 3063.5413 3075.7631 3427.4577 3429.0678
redmass: 2.9324 2.6793 1.4583 1.5962 2.3032 2.7119 2.1945 2.2782 2.0263 2.0844 3.4876 3.4691 3.0578 2.5657 1.5816 2.2835 1.6091 1.6913 2.3298 2.2551 1.7316 2.6797 2.2992 1.5893 2.0831 1.6241 1.7196 1.9497 1.9034 2.0021 1.7722 1.4090 1.6594 2.4097 2.7727 2.1068 4.4887 1.2392 1.4684 1.1912 1.3393 1.2572 1.2774 1.5763 1.2945 1.2220 1.3176 1.4925 1.6527 1.3607 1.4466 1.4523 1.2255 1.4731 1.3197 1.2415 1.1027 1.0938 1.0953 1.1667 1.1028 1.0640 1.0596 1.0775 1.0825 1.0703 1.0684 1.0688 1.0605 1.0634 1.0423 1.0696 1.0995 1.1002 1.0931 1.0887 1.1002 1.0991 1.0984 1.0746 1.0747
irintensity: 0.1777 0.2489 1.3607 0.4193 1.0700 2.3136 2.9099 0.8899 3.5491 8.5371 0.9080 0.6690 0.6515 1.0753 109.1584 34.5135 0.4237 99.5623 5.2855 0.4988 2.0938 0.1596 0.9716 3.8905 0.8235 0.8890 2.2303 10.5498 3.6560 1.6688 0.3221 1.5276 6.0986 1.2003 0.1173 6.2613 65.3821 5.0564 12.5959 0.4219 1.3917 1.1359 0.6725 2.0708 5.0253 62.0343 0.3150 6.0900 8.4213 0.2051 1.3020 0.5862 18.4649 2.4522 1.0671 1.8373 12.5854 1.7224 2.2760 10.1587 3.5357 21.3817 4.5282 41.4728 80.2817 64.9009 175.2638 7.7146 33.9836 90.6094 47.6713 48.6023 44.3986 21.4996 34.0984 85.2246 81.1013 43.1384 52.8156 4.8751 2.4410
temp: 298.150 k
press: 1.00000 atm
elementType: 7 7 6 6 6 6 6 6 6 6 6 1 1 1 1 1 1 1 1 1 1 1 1 1 1 1 1 1 1
symmnumber: 1
zpe: 692010.9 jmol-1
zpe.correction: 0.263573 hartree
zpe.thermalcorrener: 0.273924 hartree
zpe.thermalcorrenthalpy: 0.274868 hartree
zpe.thermalcorrgfe: 0.228794 hartree
zpe.sumelectzpe: -462.345521 hartree
zpe.sumelectthermal: -462.335171 hartree
zpe.sumelectthermalent: -462.334226 hartree
zpe.sumelectthermalfe: -462.380300 hartree
dipole: 0.1860 0.0188 -0.0979
dipole: 0.2110
quadrupole: -66.2490 -64.1073 -72.9963
quadrupole: -0.5315 -0.8213 -2.4492
quadrupole: 1.5352 3.6769 -5.2121 -0.5315 -0.8213 -2.4492
hfenergy: -462.6090945 hartree
pointgroup: C01 [X(C9H18N2)]
dipole: -0.0736311 0.0058736 0.0379193 debye
polarizability: 124.759417|-0.5664074|104.5660162|-0.3559802|0.1607699|88.7873724 unknown
InChI: InChI=1S/C9H18N2/c1-7-2-3-8-9(6-7)11-5-4-10-8/h7-11H,2-6H2,1H3
charge 0 multiplicity 1
29 atoms
N  1.415567 -1.434629 0.316262
N  1.632043 1.309595 -0.367518
C  0.204968 -0.675664 -0.086204
C  0.407659 0.808893 0.302158
C  -1.050922 -1.243583 0.604356
C  -2.334466 -0.431459 0.270265
C  -0.828521 1.637894 -0.094921
C  -2.103536 1.076497 0.581241
C  2.641826 -0.933404 -0.349322
C  2.842221 0.548778 0.025804
C  -2.820233 -0.660264 -1.183122
H  0.068475 -0.69521 -1.1970
H  0.512117 0.829327 1.419022
H  -0.873855 -1.232874 1.698575
H  -1.192653 -2.304565 0.31021
H  -3.139787 -0.793238 0.943256
H  -0.926678 1.62854 -1.197684
H  -0.682747 2.696609 0.203022
H  -2.010468 1.204204 1.679516
H  -2.98867 1.662208 0.263991
H  1.288677 -2.449196 0.193625
H  1.747854 2.325155 -0.243343
H  2.587078 -1.002196 -1.463472
H  3.509171 -1.525393 -0.002656
H  3.046829 0.601592 1.123168
H  3.716907 0.954957 -0.515312
H  -2.987226 -1.736575 -1.377122
H  -3.775429 -0.1325 -1.364499
H  -2.090899 -0.296498 -1.928796
