program: Gaussian 09
title: 000242029
version: EM64L-G09RevD.01
frameworkgroup: C1[X(C10H13NO2)]
method: RPBEPBE
basis: SDD
operation: Freq
keyword: #p
keyword: freq=noraman
keyword: PBEPBE/SDD
title: #p freq=noraman PBEPBE/SDD
converged: YES YES NO NO
title: Mulliken charges:
elementType: O O N C C C C C C C C C C H H H H H H H H H H H H H
charge: -0.397330 -0.250675 -0.311983 -0.305953 -0.418351 0.508724 0.152457 -0.391592 -0.441696 -0.234369 -0.221420 -0.631740 -0.243341 0.265868 0.220160 0.225044 0.285515 0.250983 0.236812 0.226599 0.227276 0.194837 0.224272 0.223982 0.229624 0.376296
chargesum: 0.00000
title: Mulliken charges with hydrogens summed into heavy atoms:
elementType: O O N C C C C C C C C C C
charge: -0.021034 -0.250675 -0.026468 -0.040085 0.026853 0.508724 0.152457 -0.140609 -0.204883 -0.007770 0.005857 0.011350 -0.013717
polarizability: 1.52466877e+02 8.04107986e+00 9.11456455e+01 2.02703501e+00 4.77176183e+00 1.10484190e+02
1716.lowfreq: -11.4362 -6.1147 -2.3404 0.0005 0.0006 0.0008 37.9414 44.1317 70.1120
frequency: 37.9170 44.1130 70.0877 78.7607 101.5094 123.2625 197.0424 225.8212 249.2283 289.6646 306.4794 336.8913 404.9534 472.7855 506.7411 549.5542 601.1179 619.9782 621.4181 692.9492 706.5672 728.4990 764.9340 806.8125 854.4086 859.2073 921.4023 958.6118 977.4344 990.4181 995.4452 998.5620 1026.6208 1033.5948 1081.3358 1088.7100 1121.1823 1138.7895 1172.6747 1176.1524 1190.5669 1195.5173 1228.0784 1244.7790 1272.9497 1329.7867 1351.2954 1358.1942 1383.4286 1435.7900 1441.7964 1458.2604 1467.9010 1473.9031 1481.4686 1494.2456 1592.9602 1610.1783 1645.4452 2878.6460 2899.5036 3013.9370 3029.0473 3048.2570 3074.8304 3120.6343 3123.7957 3136.3442 3147.0278 3164.1900 3456.7254 3509.8064
redmass: 4.0088 7.8695 3.9318 3.2061 2.5891 3.8031 1.8419 3.5550 1.6878 4.8717 3.8522 4.2582 2.8190 3.5658 3.0480 2.9225 4.0592 4.6959 1.6883 3.4954 1.6905 1.4942 1.9278 3.0397 1.2514 3.4861 1.4314 2.3430 1.3888 5.6352 1.4290 1.5612 2.3112 2.9866 1.6652 1.7322 1.6654 2.0430 1.0578 2.6525 1.1144 1.8020 1.8519 1.5842 1.3891 1.2968 1.6972 1.3403 6.7781 1.1436 2.1612 1.1790 1.0742 1.1354 2.0970 1.0466 6.1136 6.0550 7.9021 1.0559 1.0687 1.0762 1.0885 1.0858 1.0995 1.0856 1.0875 1.0918 1.0962 1.1016 1.0742 1.0639
irintensity: 0.0343 1.7160 0.1806 3.0642 1.3778 0.8750 1.1523 1.5798 2.4109 1.5851 2.1454 1.1146 0.0171 6.1240 29.2488 60.4079 8.5228 6.9684 121.8512 6.9791 57.7074 109.6438 39.8598 6.1499 0.0381 1.8626 2.1949 1.5118 0.1117 0.8180 7.3472 18.4760 11.0435 167.6046 17.1193 94.5311 26.8719 36.0960 0.3955 27.6268 0.5193 7.2173 7.9311 6.2375 9.4023 5.7630 38.7755 9.6948 2.0676 2.9973 9.5384 32.5019 13.1827 19.7467 14.1935 22.7433 3.7095 15.7980 194.2526 138.4074 88.1416 52.9566 13.9049 10.6563 39.7779 4.7558 0.5773 12.7312 36.7044 22.4929 2.9198 24.9819
temp: 298.150 k
press: 1.00000 atm
elementType: 8 8 7 6 6 6 6 6 6 6 6 6 6 1 1 1 1 1 1 1 1 1 1 1 1 1
symmnumber: 1
zpe: 557405.5 jmol-1
zpe.correction: 0.212305 hartree
zpe.thermalcorrener: 0.225275 hartree
zpe.thermalcorrenthalpy: 0.226220 hartree
zpe.thermalcorrgfe: 0.171471 hartree
zpe.sumelectzpe: -593.081451 hartree
zpe.sumelectthermal: -593.068480 hartree
zpe.sumelectthermalent: -593.067536 hartree
zpe.sumelectthermalfe: -593.122284 hartree
dipole: -0.7710 -0.4705 -0.1335
dipole: 0.9130
quadrupole: -71.8034 -72.7130 -76.9459
quadrupole: 0.0612 -0.4247 -0.3054
quadrupole: 2.0173 1.1078 -3.1251 0.0612 -0.4247 -0.3054
hfenergy: -593.2937553 hartree
pointgroup: C01 [X(C10H13N1O2)]
dipole: 0.34214 -0.1041007 0.0336169 debye
dipolederiv: -0.3736454 -0.091982 0.0327462 -0.0402059 -1.0025947 -0.4779151 0.0328757 -0.4312742 -0.5499928 -0.6573508 -0.0744279 -0.3007285 0.1843986 -0.6352324 0.0339304 -0.3717008 -0.1598414 -0.6647363 -0.6822088 -0.2699633 0.1335692 -0.2618661 -0.6134132 -0.1465147 0.2244589 -0.0847685 -0.4730435 -0.2651417 0.0783337 -0.0553741 -0.063289 -0.074037 0.0419448 -0.1516911 0.0307195 0.0851399 0.5547236 0.160935 -0.1355225 0.1952005 0.1952104 -0.0433728 -0.0430282 0.0262968 0.3270958 0.4178201 -0.0095922 -0.0558518 0.0069879 -0.1293428 0.0122131 -0.1528898 0.0051747 -0.0080087 0.7069864 -0.0644297 0.4300973 -0.3625097 1.3732804 0.3527966 0.5709631 0.4393773 0.8534078 -0.0858577 -0.0009495 0.0614301 0.010288 -0.1406794 -0.0190665 0.1220174 -0.0045602 -0.0473008 -0.156122 -0.0008196 -0.0250384 0.020152 -0.139892 -0.0208661 0.0136758 -0.0273257 0.0806709 -0.0356756 -0.0050684 -0.0318837 0.0051021 -0.1380026 -0.0309812 -0.0559302 -0.0375007 0.1296267 0.0350787 -0.0035361 0.0887155 -0.0101124 -0.1308839 -0.0200076 0.084776 -0.0206583 0.0411681 0.1758312 0.1060466 0.0265909 0.2655771 0.5476035 0.0864941 -0.0430821 0.0227428 0.3217277 0.0668374 0.0051482 -0.046954 0.008854 -0.1676108 -0.0128913 -0.0353023 -0.0006406 -0.0671653 0.0813301 0.0161955 -0.0219516 0.0103158 0.0507311 -0.015071 0.0211455 -0.0158044 -0.0685768 -0.0714464 -0.0568931 0.0595772 -0.0236024 0.0435976 0.004246 0.1625288 -0.0221357 -0.1970677 0.017802 0.0531614 -0.0264368 0.1030298 -0.0617949 0.0464814 -0.023732 0.0775239 0.0317597 0.1321602 0.0195525 -0.0221306 0.0251245 0.1745821 0.0899657 -0.1129953 0.1384385 0.1900843 -0.0031588 0.0092142 -0.094412 0.0048261 0.1356072 0.0126126 -0.0990902 0.0090313 0.0345574 0.0741052 -0.0080721 0.0782568 -0.0007802 0.1389039 0.0221221 0.0515283 0.0252115 -0.0815045 0.0554131 -0.0066019 0.0457805 -0.0056832 0.1509346 0.0307376 0.0690051 0.0324557 -0.108656 -0.0443104 0.0105876 -0.0998865 0.0059533 0.154625 0.0199771 -0.1131075 0.0173804 -0.0154483 0.0536022 -0.0144254 0.0352403 -0.1282822 -0.1493038 -0.1015063 -0.0688767 -0.2211991 -0.2048819 -0.2001511 -0.0659229 0.0718907 -0.0075626 0.0582657 -0.00961 0.0739705 -0.0158135 0.0843364 0.0471331 0.1178406 -0.1094675 0.0076982 -0.0572109 0.0756451 -0.0787535 0.1041387 -0.028041 -0.1248784 -0.0084107 0.0574937 -0.0067724 0.158513 0.0100337 0.0597965 0.0102029 0.0744585 0.2811238 0.1040794 -0.0957503 0.0571582 0.2581438 0.0586022 -0.1365618 0.1028283 0.2603902 unknown
polarizability: 152.8741211|6.9838173|90.4556163|-0.5046059|-3.421533|110.7669753 unknown
InChI: InChI=1S/C10H13NO2/c1-11-7-9(10(12)13)8-5-3-2-4-6-8/h2-6,9,11-12H,7H2,1H3
charge 0 multiplicity 1
26 atoms
O  -1.277075 2.277899 0.85167
O  -2.270105 1.202807 -0.94469
N  -2.803931 -1.461551 0.43631
C  -0.739501 -0.059212 0.554957
C  -1.389718 -1.36888 0.032936
C  0.734476 0.041913 0.142822
C  -1.513421 1.156259 0.054273
C  1.093324 0.197663 -1.22155
C  1.758683 -0.064338 1.11501
C  2.452349 0.245458 -1.602698
C  3.118886 -0.019924 0.734203
C  -3.381818 -2.816717 0.367639
C  3.469928 0.134516 -0.62659
H  -0.81244 -0.052828 1.656713
H  -1.239781 -1.43646 -1.070906
H  -0.840109 -2.215708 0.485437
H  -3.37161 -0.773615 -0.076229
H  0.309883 0.29142 -1.983668
H  1.490456 -0.177077 2.172279
H  2.718137 0.369937 -2.658533
H  3.901406 -0.10244 1.496865
H  -3.327359 -3.294559 -0.640936
H  -4.443715 -2.778982 0.669188
H  -2.857738 -3.48103 1.079772
H  4.524231 0.171716 -0.922725
H  -1.771339 3.058732 0.480552
