program: Gaussian 09
title: 000242031
version: EM64L-G09RevD.01
frameworkgroup: C1[X(C11H14O3)]
method: RPBEPBE
basis: SDD
operation: Freq
keyword: #pfreq=noraman
keyword: PBEPBE/SDD
title: #p freq=noraman PBEPBE/SDD
converged: YES YES NO NO
title: Mulliken charges:
elementType: O O O C C C C C C C C C C C H H H H H H H H H H H H H H
charge: -0.426249 -0.414045 -0.232505 -0.372759 -0.092363 -0.382246 0.466261 0.193361 -0.687215 -0.382095 -0.436417 -0.232968 -0.224409 -0.241446 0.241804 0.243911 0.183232 0.236773 0.214891 0.232454 0.214985 0.272129 0.233101 0.328982 0.227700 0.227150 0.230015 0.377966
chargesum: 0.00000
title: Mulliken charges with hydrogens summed into heavy atoms:
elementType: O O O C C C C C C C C C C C
charge: -0.097266 -0.036079 -0.232505 -0.130955 0.151548 0.037759 0.466261 0.193361 -0.024885 -0.109966 -0.203315 -0.005268 0.002741 -0.011432
polarizability: 1.48443716e+02 1.32708556e+01 1.03641190e+02 4.99657077e+00 -5.19383739e+00 1.19198792e+02
1716.lowfreq: -12.0878 -9.9765 -4.9329 0.0006 0.0007 0.0008 33.4406 45.8686 61.6336
frequency: 33.2424 45.8580 61.6191 76.3683 102.2361 125.7734 153.0916 206.2311 237.5786 256.1259 283.9397 307.1124 336.2755 340.6410 405.3295 448.8990 483.0620 501.6970 580.6287 609.5621 622.2719 644.9202 705.3204 707.9133 761.6686 772.1639 846.7368 856.3373 868.1504 902.3322 928.3059 947.2808 979.3079 990.2405 997.3144 1014.7929 1028.0834 1045.3672 1052.5946 1080.7051 1095.9498 1111.2258 1172.7995 1188.4907 1191.8685 1197.1422 1229.2547 1244.6098 1287.3136 1308.1885 1334.8162 1342.6530 1351.6757 1365.5132 1384.8147 1390.8269 1442.8314 1462.5399 1472.4322 1481.2940 1488.5500 1592.0209 1610.6538 1665.6885 2956.8739 2984.5748 3022.9506 3034.5705 3059.1167 3078.9862 3091.7655 3118.3609 3128.4727 3140.9399 3152.5629 3165.4952 3503.8536 3537.9277
redmass: 5.8090 3.9211 4.1960 3.0420 2.8933 6.4793 3.9924 1.3780 2.5539 3.4348 2.3104 4.8392 3.3730 2.0209 2.8320 2.4592 3.5746 3.1344 3.3432 3.3161 2.8441 2.8150 2.6498 2.1751 1.8146 1.4679 4.4003 1.2747 2.0716 3.5468 1.6150 2.1324 1.4059 5.3322 1.3793 3.7508 2.2029 1.7209 2.0744 1.6160 2.1499 2.3250 1.0628 1.2801 1.1304 2.1452 1.3429 1.6620 1.2197 1.5004 1.3165 1.5310 1.6450 1.2213 5.6864 1.2092 2.1279 1.0808 1.0409 2.2610 1.0574 6.0158 6.0317 8.4250 1.0659 1.0361 1.0838 1.0915 1.0889 1.0995 1.1000 1.0868 1.0870 1.0922 1.0957 1.1014 1.0638 1.0657
irintensity: 2.5578 0.0550 0.1036 0.6075 0.8635 0.6084 2.3611 0.2759 0.1471 0.5822 32.8533 3.7199 8.9022 115.8423 0.0591 7.8009 14.0209 5.9148 68.2139 31.0877 51.5477 50.0002 59.3615 25.5371 36.2674 7.4558 3.1735 0.2576 15.0814 28.1491 1.6315 36.5241 0.3532 1.0339 1.1248 19.8072 9.2921 52.3514 295.7100 29.7902 29.7221 2.8380 0.4771 16.4105 1.1106 4.1717 6.6555 0.8642 4.6959 4.6035 11.0642 19.6230 33.4386 47.1233 2.8410 16.4532 12.1593 1.5808 11.8338 21.9049 12.4454 1.8255 7.1949 173.0767 26.5818 33.9498 7.3842 7.9381 14.9938 48.8107 30.7752 6.8739 1.1677 23.5569 19.2468 21.1296 22.4108 7.2816
temp: 298.150 k
press: 1.00000 atm
elementType: 8 8 8 6 6 6 6 6 6 6 6 6 6 6 1 1 1 1 1 1 1 1 1 1 1 1 1 1
symmnumber: 1
zpe: 596557.8 jmol-1
zpe.correction: 0.227217 hartree
zpe.thermalcorrener: 0.241449 hartree
zpe.thermalcorrenthalpy: 0.242393 hartree
zpe.thermalcorrgfe: 0.185057 hartree
zpe.sumelectzpe: -652.189649 hartree
zpe.sumelectthermal: -652.175417 hartree
zpe.sumelectthermalent: -652.174473 hartree
zpe.sumelectthermalfe: -652.231809 hartree
dipole: 1.0026 1.2626 -2.4630
dipole: 2.9438
quadrupole: -80.7368 -80.8467 -81.1256
quadrupole: 2.6829 6.5975 1.6745
quadrupole: 0.1662 0.0563 -0.2225 2.6829 6.5975 1.6745
hfenergy: -652.4168663 hartree
pointgroup: C01 [X(C11H14O3)]
dipole: -0.3828302 0.3075785 1.0488981 debye
polarizability: 146.6594712|-16.5845223|103.9646799|2.3641554|1.386904|120.6595471 unknown
InChI: InChI=1S/C11H14O3/c1-2-9(12)10(11(13)14)8-6-4-3-5-7-8/h3-7,9-10,12-13H,2H2,1H3
charge 0 multiplicity 1
28 atoms
O  3.103337 0.035391 -0.053802
O  1.474867 -2.837313 0.381804
O  0.969982 -1.95506 -1.704004
C  0.717728 -0.544268 0.325386
C  1.727559 0.570477 -0.118904
C  1.584691 1.86549 0.70421
C  -0.742863 -0.124642 0.14325
C  1.047621 -1.807251 -0.466238
C  2.509881 2.990287 0.194965
C  -1.295251 0.077943 -1.148535
C  -1.555955 0.103523 1.28177
C  -2.633378 0.50666 -1.291674
C  -2.894953 0.532194 1.137963
C  -3.437479 0.738001 -0.151111
H  0.900532 -0.766204 1.393321
H  1.584669 0.773737 -1.194841
H  1.810472 1.638208 1.768869
H  0.530612 2.199256 0.672618
H  2.452122 3.878504 0.849632
H  3.559302 2.649275 0.158494
H  2.223674 3.302763 -0.826408
H  -0.684436 -0.125599 -2.034601
H  -1.141388 -0.058362 2.284503
H  3.326851 -0.145575 0.896119
H  -3.050183 0.656209 -2.294061
H  -3.511848 0.701999 2.027591
H  -4.475448 1.069895 -0.265568
H  1.704583 -3.63634 -0.167347
