program: Gaussian 09
title: 000241486
version: EM64L-G09RevD.01
frameworkgroup: C1[X(C26H24ClNO2)]
method: RPBEPBE
basis: SDD
operation: Freq
keyword: #p
keyword: freq=noraman
keyword: PBEPBE/SDD
title: #p freq=noraman PBEPBE/SDD
converged: YES YES NO NO
title: Mulliken charges:
elementType: Cl O O N C C C C C C C C C C C C C C C C C C C C C C C C C C H H H H H H H H H H H H H H H H H H H H H H H H
charge: -0.084637 -0.442740 -0.429445 -0.148916 -0.537945 -0.480440 -0.519277 0.237141 0.191519 0.354361 0.480278 0.112892 0.438507 -0.105450 -0.291313 -0.374304 -0.423168 -0.462062 0.361952 -0.448583 -0.375916 -0.444010 -0.123263 -0.269084 -0.417413 -0.251180 -0.866022 -0.241543 -0.227989 -0.237778 0.237834 0.249281 0.252131 0.243740 0.236203 0.196338 0.298712 0.290703 0.214589 0.238035 0.238010 0.258083 0.234575 0.227985 0.257098 0.226586 0.252836 0.232210 0.236188 0.227268 0.223628 0.356639 0.226932 0.370223
chargesum: 0.00000
title: Mulliken charges with hydrogens summed into heavy atoms:
elementType: Cl O O N C C C C C C C C C C C C C C C C C C C C C C C C C C
charge: -0.084637 -0.086101 -0.059221 -0.148916 -0.050830 0.015430 -0.086736 0.237141 0.191519 0.354361 0.480278 0.112892 0.438507 -0.105450 0.007399 -0.083601 -0.208579 -0.224027 0.361952 -0.210573 -0.117833 -0.209434 -0.123263 -0.041099 -0.160316 -0.024594 -0.144788 -0.014275 -0.004361 -0.010846
polarizability: 2.74452947e+02 5.94699183e+00 2.93847165e+02 1.54346220e+01 3.56137179e+01 3.42891502e+02
1716.lowfreq: -6.2834 -4.5118 -0.0012 0.0007 0.0009 4.9742 12.8586 13.8968 18.8411
frequency: 12.4802 13.7095 18.7753 24.6891 31.7611 49.1611 67.9671 75.7629 95.0826 98.6022 107.7090 135.6706 147.8121 159.7019 184.0169 206.2663 212.9576 219.1764 248.1349 280.5996 290.5368 299.3910 313.8278 318.4066 321.5803 330.5126 343.3271 350.6602 355.9722 381.6118 392.2096 404.7845 424.7188 428.5194 479.9639 492.4974 495.4196 515.3925 517.9553 530.1470 549.0631 554.1424 556.1385 592.9718 609.8905 615.8516 617.4472 660.4245 701.7004 705.5555 714.5785 724.7471 744.6344 749.4302 756.0439 782.9361 806.7852 816.2002 835.4735 852.3612 857.9672 861.4774 863.4615 878.0790 893.7169 912.0750 922.8050 932.4390 938.8664 961.8318 967.2109 972.4709 980.2152 990.5790 991.5332 996.1999 1004.9022 1011.0674 1026.5652 1035.1496 1042.0566 1058.6114 1081.4318 1092.8947 1100.1388 1115.1774 1146.8879 1155.3572 1163.2692 1170.9542 1174.2506 1185.2355 1198.0513 1204.8635 1214.8223 1224.9112 1230.7766 1234.2154 1242.5261 1256.9107 1267.6639 1280.5911 1286.4676 1324.9408 1354.2092 1360.3503 1367.0807 1375.2806 1386.1091 1389.5453 1398.1548 1407.9414 1421.7839 1426.7007 1437.5643 1439.5583 1443.3242 1465.0055 1468.1989 1471.4168 1477.9095 1483.7851 1484.2737 1486.0080 1516.8786 1589.5443 1590.9804 1593.5152 1609.8243 1613.2767 1617.0651 1636.9075 2863.5085 2929.2361 2933.6439 2952.9838 3013.3560 3017.8415 3021.3568 3021.6098 3089.3835 3108.6366 3114.3333 3118.9265 3122.4411 3133.2382 3134.6651 3141.7368 3145.3578 3155.7433 3156.0384 3161.7104 3165.2255 3174.9961 3581.1385 3585.1898
redmass: 6.5259 6.5533 5.3218 6.2459 4.9468 4.2966 5.2611 5.6041 4.5919 5.4855 4.9325 4.3927 1.9240 1.7264 4.4397 4.5692 3.8263 3.6578 3.0193 3.0421 3.4200 1.3360 1.3480 2.6640 3.9893 2.6704 4.4232 2.8418 13.3748 3.4510 3.8686 2.8358 3.1634 7.0215 3.5294 3.8937 3.6626 3.9004 5.0397 3.4618 3.9149 4.4035 4.0250 5.0504 4.5362 4.8035 5.9040 3.9755 5.3801 2.0109 4.4260 4.5976 3.8156 2.1844 1.3387 3.1609 1.5128 3.2544 4.1977 6.8524 1.2709 4.5299 1.3500 1.6256 3.2468 1.3792 1.4493 2.7817 1.3391 2.0780 1.4132 1.9049 1.4048 3.9482 1.4607 1.3423 1.8712 2.2132 2.1878 2.1677 1.5017 3.1274 1.6981 1.7290 2.4220 2.2672 1.4674 1.9621 1.1849 1.0540 1.1290 1.1127 2.3420 1.5453 2.4225 1.2693 1.6618 1.3284 3.5668 1.3896 1.6808 1.8683 2.1489 1.2837 1.4495 1.4847 2.2671 1.8098 5.1470 3.2834 1.3284 3.1237 3.5496 3.7410 3.2015 2.2000 2.6560 1.1207 1.3574 1.8231 1.0439 1.7675 1.3912 1.1526 3.7624 6.5512 7.5231 6.0866 5.6908 6.1068 7.6633 6.7405 1.0710 1.0673 1.0671 1.0403 1.0919 1.0878 1.0972 1.0913 1.0944 1.0874 1.0868 1.0866 1.0860 1.0899 1.0912 1.0965 1.0961 1.0967 1.0928 1.1015 1.0925 1.0957 1.0655 1.0661
irintensity: 0.4851 0.0227 0.1564 0.1269 0.4218 0.0388 0.9322 0.2435 2.5420 0.2023 0.3002 0.7376 0.4574 0.2583 1.8775 3.8890 10.5059 3.1886 5.1209 11.9236 7.9262 80.6599 91.8501 26.7083 6.0527 9.5327 10.7382 2.9093 2.1470 0.4680 1.4524 0.1098 6.8809 2.0676 12.8104 7.1863 5.9933 2.3389 0.7351 1.1305 8.1012 6.7896 3.4541 15.4905 3.0620 0.3518 0.8079 6.9996 20.3075 36.5229 13.5541 3.7189 53.3682 49.2581 19.7651 8.7783 74.4567 17.6901 5.6036 34.1516 1.3950 1.2904 18.0539 2.0788 13.0032 21.8883 4.8226 26.5579 0.8716 28.1336 7.6960 12.1534 0.4835 0.3510 0.6103 0.2829 12.2788 37.9953 7.7004 8.0758 5.7456 22.5163 24.2831 2.9548 28.0676 33.6516 33.2960 216.3439 27.3806 0.0613 1.3705 2.7262 2.4266 16.8042 6.1138 41.5059 14.9318 27.9607 106.5522 19.1647 7.6129 5.4808 16.2533 2.7798 4.8816 7.8005 11.3115 5.4211 5.5402 26.7538 23.4595 5.7691 1.3498 3.3878 1.2355 7.8764 66.4550 7.8156 4.0933 13.0943 15.1603 20.3265 28.0771 4.8853 35.5660 5.3719 8.7088 0.8103 8.3902 2.7357 5.2668 27.5144 91.7830 29.0011 48.3643 40.7115 8.4050 16.4977 11.2802 19.1495 12.0188 12.8034 5.9603 2.1787 0.3025 18.1820 15.2948 27.2555 38.3352 29.2269 3.0314 24.4523 5.7052 5.8907 29.4350 39.8839
temp: 298.150 k
press: 1.00000 atm
elementType: 17 8 8 7 6 6 6 6 6 6 6 6 6 6 6 6 6 6 6 6 6 6 6 6 6 6 6 6 6 6 1 1 1 1 1 1 1 1 1 1 1 1 1 1 1 1 1 1 1 1 1 1 1 1
symmnumber: 1
zpe: 1124070.7 jmol-1
zpe.correction: 0.428136 hartree
zpe.thermalcorrener: 0.455437 hartree
zpe.thermalcorrenthalpy: 0.456381 hartree
zpe.thermalcorrgfe: 0.367063 hartree
zpe.sumelectzpe: -1668.303753 hartree
zpe.sumelectthermal: -1668.276451 hartree
zpe.sumelectthermalent: -1668.275507 hartree
zpe.sumelectthermalfe: -1668.364826 hartree
dipole: -1.1767 -2.4935 -3.0163
dipole: 4.0866
quadrupole: -159.6840 -164.9226 -174.1893
quadrupole: 1.1356 8.4559 8.7638
quadrupole: 6.5813 1.3427 -7.9240 1.1356 8.4559 8.7638
hfenergy: -1668.7318885 hartree
pointgroup: C01 [X(C26H24Cl1N1O2)]
dipole: 0.6342556 0.9874071 -1.0989715 debye
polarizability: 280.5507265|11.3260646|294.209732|-24.7965268|-34.5595648|336.4311564 unknown
InChI: InChI=1S/C26H24ClNO2/c1-18-13-22(27)14-21(26(18)30)16-28(15-19-7-3-2-4-8-19)17-24-23-10-6-5-9-20(23)11-12-25(24)29/h2-14,29-30H,15-17H2,1H3
charge 0 multiplicity 1
54 atoms
Cl 2.424012 -0.183535 3.828767
O  -1.546441 2.261226 -3.242439
O  3.839657 1.49531 -1.784089
N  0.175857 -0.383497 -1.116311
C  -1.148437 -0.116031 -1.758449
C  1.141868 0.735948 -1.269688
C  0.757315 -1.675584 -1.580005
C  -1.878499 1.07828 -1.165061
C  -2.415267 1.047717 0.175553
C  2.214963 0.710487 -0.187263
C  0.014114 -2.893063 -1.044346
C  -2.082015 2.235341 -1.934728
C  -3.14176 2.192194 0.693968
C  3.550353 1.102225 -0.457828
C  1.880331 0.325033 1.132618
C  -2.259073 -0.096606 1.030237
C  -2.800133 3.36745 -1.432801
C  -3.318355 3.342536 -0.14106
C  4.55658 1.104792 0.549978
C  -3.676471 2.151716 2.023701
C  -0.013059 -3.153386 0.351019
C  -0.638707 -3.79664 -1.918116
C  2.869495 0.327923 2.127044
C  -2.794625 -0.10808 2.320391
C  4.19742 0.708283 1.859662
C  -3.508598 1.02329 2.827652
C  5.978829 1.524733 0.220629
C  -0.679242 -4.289369 0.859059
C  -1.30909 -4.936108 -1.41349
C  -1.331445 -5.185191 -0.022679
H  -1.758065 -1.02822 -1.614174
H  -1.039302 0.036048 -2.855383
H  0.571412 1.679971 -1.187077
H  1.625864 0.748462 -2.271571
H  1.802887 -1.699365 -1.218817
H  0.797005 -1.72258 -2.697357
H  0.848665 0.025963 1.338507
H  -1.699162 -0.960247 0.66304
H  -2.937585 4.251209 -2.070076
H  -3.868961 4.20643 0.248763
H  -4.222406 3.025955 2.398948
H  0.494699 -2.460429 1.032116
H  -0.621549 -3.606627 -2.998837
H  -2.663968 -0.992208 2.954499
H  4.949005 0.698768 2.654969
H  -3.918043 0.999332 3.843409
H  6.618969 1.466127 1.115794
H  6.442614 0.871552 -0.546934
H  6.031576 2.570285 -0.14536
H  -0.686476 -4.480726 1.938315
H  -1.811883 -5.624556 -2.10234
H  -1.749994 3.122951 -3.682441
H  -1.849043 -6.067293 0.371114
H  4.801858 1.700401 -1.88613
