program: Gaussian 09
title: 000241485
version: EM64L-G09RevD.01
frameworkgroup: C1[X(C25H21Cl2NO2)]
method: RPBEPBE
basis: SDD
operation: Freq
keyword: #p
keyword: freq=noraman
keyword: PBEPBE/SDD
title: #p freq=noraman PBEPBE/SDD
converged: YES YES NO NO
title: Mulliken charges:
elementType: Cl Cl O O N C C C C C C C C C C C C C C C C C C C C C C C C C H H H H H H H H H H H H H H H H H H H H H
charge: -0.063949 -0.063868 -0.442781 -0.414142 -0.151788 -0.537004 -0.469066 0.235535 -0.520938 0.192877 0.374503 0.479689 0.437850 0.112229 -0.376217 -0.460721 -0.421781 0.165549 -0.274845 -0.447872 -0.376077 -0.441000 -0.268809 -0.251061 -0.258618 -0.123472 -0.239921 -0.227400 -0.269610 -0.237074 0.239576 0.250958 0.259489 0.245456 0.235456 0.199832 0.288504 0.239108 0.216045 0.301415 0.239061 0.253018 0.235199 0.228402 0.227613 0.227781 0.224988 0.279724 0.358105 0.228207 0.361845
chargesum: 0.00000
title: Mulliken charges with hydrogens summed into heavy atoms:
elementType: Cl Cl O O N C C C C C C C C C C C C C C C C C C C C C C C C C
charge: -0.063949 -0.063868 -0.084676 -0.052297 -0.151788 -0.046470 0.035878 0.235535 -0.085650 0.192877 0.374503 0.479689 0.437850 0.112229 -0.087713 -0.221613 -0.205735 0.165549 0.026570 -0.208810 -0.123059 -0.205801 -0.040407 -0.023449 -0.258618 -0.123472 -0.012141 -0.002412 0.010114 -0.008867
polarizability: 2.84179728e+02 1.55912232e+01 2.86523859e+02 2.41015314e+01 3.51354122e+01 3.37976932e+02
1716.lowfreq: -7.7601 -4.5210 -3.0761 -0.0006 0.0007 0.0010 12.5067 14.2076 15.5406
frequency: 12.1189 14.1278 15.4017 23.7459 32.9918 47.3599 65.9490 73.9548 93.1461 96.3550 107.7929 134.0128 141.5965 176.9387 185.4498 208.7212 214.8708 232.5329 277.1175 283.3528 308.0514 318.2297 320.0769 332.4831 336.3886 348.6722 354.9657 371.4670 389.3983 395.5029 405.3249 423.5129 428.3007 451.2138 479.2657 488.7030 507.2785 517.2978 530.8428 545.5360 552.7643 555.6515 590.0272 609.6287 616.1152 617.2493 660.6370 689.2313 702.4177 706.1847 709.9325 724.1295 748.9085 756.8613 782.2772 807.5914 809.9113 817.4271 836.2170 848.0253 857.4676 860.6591 878.1328 878.5440 901.0499 916.2513 924.8894 939.6200 960.8496 967.3980 971.3656 979.8898 990.8432 992.7729 996.7087 1009.0705 1025.3540 1034.4638 1057.5543 1067.5915 1081.2079 1099.8645 1112.6948 1126.6760 1146.1907 1162.8506 1171.1945 1174.1074 1184.2015 1191.3820 1204.3254 1214.8364 1217.6875 1229.5605 1231.6369 1239.8318 1242.3344 1259.6109 1277.9789 1286.7084 1323.2721 1355.0600 1359.1457 1366.6256 1374.6244 1386.2734 1387.4104 1405.3556 1408.0209 1426.1105 1437.1771 1439.3553 1444.9970 1464.7386 1468.2788 1471.3566 1483.3553 1486.5009 1516.7773 1578.6833 1590.7286 1593.3427 1597.9561 1609.4935 1613.2811 1636.7143 2867.7465 2930.4880 2935.0527 3016.1908 3019.9911 3025.1573 3109.2018 3115.1611 3119.7831 3122.3121 3133.1791 3134.7087 3142.1727 3145.4960 3155.5230 3162.2829 3168.5007 3171.0101 3186.4353 3495.5709 3586.9087
redmass: 9.8068 6.3374 6.9188 7.5563 5.2074 4.1339 5.7623 6.6261 5.4584 6.4251 6.7526 5.1495 8.1561 6.9601 6.6222 4.4779 5.0965 4.0613 4.5581 3.5900 5.3282 3.9593 1.2054 2.3418 5.9368 2.5991 13.9753 4.5907 5.2089 4.1121 2.8349 3.1739 7.0361 1.1030 3.5365 3.9300 3.8966 4.9846 3.4640 4.1835 4.6577 4.3407 5.1762 4.7080 5.2012 5.5208 4.0661 8.0792 5.3109 2.1138 4.7655 4.6721 1.9188 1.3304 3.1436 1.5441 5.2260 3.3835 4.3075 1.3770 1.2579 4.5820 1.7039 3.9415 3.8154 1.3815 1.4166 1.3388 2.0482 1.4085 2.0539 1.4029 4.7522 1.3746 1.3392 2.3161 2.1774 2.1578 3.0639 2.1408 1.6830 2.5488 2.2113 2.3132 1.4648 1.1825 1.0550 1.1285 1.1132 1.8259 1.5409 2.3664 1.8371 1.4199 1.4953 1.6216 3.4736 1.4063 1.7390 1.5743 1.2863 1.4711 1.4661 2.3972 1.8567 5.4079 4.1894 3.0144 3.0523 3.6897 3.2574 2.1682 3.4573 1.1744 1.3576 1.8374 2.1520 1.1173 3.7453 7.6897 7.5382 6.0720 7.7777 5.7025 6.1411 6.7312 1.0709 1.0683 1.0671 1.0878 1.0916 1.0899 1.0875 1.0869 1.0866 1.0860 1.0897 1.0912 1.0966 1.0961 1.0960 1.1015 1.0924 1.0968 1.0936 1.0648 1.0661
irintensity: 0.0453 0.0057 0.0539 0.0507 0.2676 0.0409 1.2521 0.3336 1.6982 0.3012 0.4682 0.3627 0.1966 0.4004 1.3552 8.9192 0.5749 2.1594 2.2070 8.4906 2.7558 2.7981 103.3782 17.1370 5.1849 2.4549 3.3706 3.7190 1.3371 8.5344 0.1246 6.7731 2.0252 124.3938 10.6693 1.9795 1.9368 1.6561 1.2306 13.2784 10.1442 6.3124 12.1755 3.4845 0.2205 0.7604 5.4945 81.7167 13.7395 26.7395 52.2802 2.0759 69.8228 21.2664 7.4311 66.4350 13.3632 18.9277 4.9522 23.7195 0.6648 4.9270 3.0065 28.5333 14.6056 17.6262 4.1612 0.8667 28.3167 6.3767 18.8443 0.4551 0.7904 0.6293 0.1111 53.3415 7.5502 8.8234 15.0280 13.2980 27.3411 34.9719 15.3706 117.3875 50.6285 22.6802 0.0511 1.3779 1.3515 30.0126 11.5090 9.3718 89.0835 3.4950 33.4726 37.7317 100.4027 26.9895 5.2537 15.4133 2.4639 6.8395 6.2626 15.3818 4.8151 16.0671 53.6496 15.5292 16.0537 3.1465 2.9067 12.9109 109.1289 1.0139 10.2554 4.8355 13.2192 8.0230 35.6610 12.4836 8.7910 0.6201 20.2592 8.5196 2.3686 27.6268 87.9926 21.6834 53.1951 12.7349 13.1406 8.9358 12.0768 5.9698 1.9731 0.8498 16.9539 14.7580 25.5724 38.8763 26.4248 23.3002 8.8754 8.0211 0.7885 62.6850 41.6755
temp: 298.150 k
press: 1.00000 atm
elementType: 17 17 8 8 7 6 6 6 6 6 6 6 6 6 6 6 6 6 6 6 6 6 6 6 6 6 6 6 6 6 1 1 1 1 1 1 1 1 1 1 1 1 1 1 1 1 1 1 1 1 1
symmnumber: 1
zpe: 1027975.6 jmol-1
zpe.correction: 0.391535 hartree
zpe.thermalcorrener: 0.418287 hartree
zpe.thermalcorrenthalpy: 0.419231 hartree
zpe.thermalcorrgfe: 0.330404 hartree
zpe.sumelectzpe: -2088.464823 hartree
zpe.sumelectthermal: -2088.438071 hartree
zpe.sumelectthermalent: -2088.437127 hartree
zpe.sumelectthermalfe: -2088.525955 hartree
dipole: 1.1437 -1.9447 -2.1122
dipole: 3.0905
quadrupole: -185.6041 -169.3681 -177.8711
quadrupole: -2.0907 3.7137 7.3843
quadrupole: -7.9896 8.2463 -0.2567 -2.0907 3.7137 7.3843
hfenergy: -2088.8563586 hartree
pointgroup: C01 [X(C25H21Cl2N1O2)]
dipole: -0.4163049 0.6938329 -0.9075725 debye
polarizability: 287.1496865|20.3010041|290.5313704|-27.01788|-35.2925201|330.9994617 unknown
InChI: InChI=1S/C25H21Cl2NO2/c26-20-12-19(25(30)23(27)13-20)15-28(14-17-6-2-1-3-7-17)16-22-21-9-5-4-8-18(21)10-11-24(22)29/h1-13,29-30H,14-16H2
charge 0 multiplicity 1
51 atoms
Cl 6.162554 1.717649 0.478679
Cl 2.258191 -0.248879 3.958273
O  -1.40989 2.276056 -3.205659
O  3.887187 1.575293 -1.557429
N  0.206795 -0.396197 -1.055692
C  -1.100462 -0.115764 -1.728538
C  1.18293 0.714508 -1.182711
C  -1.830799 1.085278 -1.150272
C  0.79101 -1.692103 -1.508704
C  -2.409414 1.05392 0.172704
C  2.205752 0.703084 -0.051222
C  0.012975 -2.905625 -1.0157
C  -3.133403 2.206681 0.676054
C  -1.990295 2.250881 -1.917556
C  -2.298429 -0.098376 1.023792
C  -3.265368 3.365131 -0.156219
C  -2.706104 3.3909 -1.430698
C  3.535935 1.150732 -0.272189
C  1.830549 0.285549 1.246744
C  -3.709862 2.166319 1.988108
C  -0.066386 -3.187342 0.3734
C  -0.622829 -3.785405 -1.925672
C  -2.874075 -0.109367 2.296674
C  -3.585262 1.03017 2.78916
C  4.448439 1.147851 0.811062
C  2.767007 0.302328 2.29374
C  -0.767518 -4.320126 0.840006
C  -1.327535 -4.921734 -1.462903
C  4.095261 0.730506 2.104218
C  -1.402426 -5.1916 -0.077818
H  -1.721186 -1.02227 -1.59945
H  -0.963485 0.036018 -2.822057
H  0.618343 1.664527 -1.139377
H  1.71404 0.711332 -2.160552
H  1.822078 -1.732443 -1.109089
H  0.872319 -1.727979 -2.62385
H  -1.743225 -0.970025 0.66789
H  -3.814259 4.235151 0.222125
H  -2.809065 4.281292 -2.065074
H  0.800343 -0.049534 1.395972
H  -4.253482 3.046615 2.352226
H  0.428738 -2.515171 1.084107
H  -0.565066 -3.579486 -3.002034
H  -2.778605 -0.999928 2.928053
H  -4.027171 1.00627 3.791163
H  -0.814904 -4.528356 1.915065
H  -1.815827 -5.5916 -2.179788
H  4.820325 0.738248 2.920963
H  -1.587081 3.141576 -3.649619
H  -1.946716 -6.071332 0.283766
H  4.846264 1.83748 -1.577472
