program: Gaussian 09
title: 000242026
version: EM64L-G09RevD.01
frameworkgroup: C1[X(C7H11NO)]
method: RPBEPBE
basis: SDD
operation: Freq
keyword: #p
keyword: freq=noraman
keyword: PBEPBE/SDD
title: #p freq=noraman PBEPBE/SDD
converged: YES YES NO NO
title: Mulliken charges:
elementType: O N C C C C C C C H H H H H H H H H H H
charge: -0.245205 -0.182359 -0.065619 -0.455529 -0.549131 0.194115 -0.699847 0.015721 -0.605773 0.241669 0.238144 0.227734 0.259528 0.245960 0.225326 0.245006 0.218295 0.258542 0.218553 0.214872
chargesum: 0.00000
title: Mulliken charges with hydrogens summed into heavy atoms:
elementType: O N C C C C C C C
charge: -0.245205 -0.182359 0.176050 0.010349 -0.043643 0.194115 -0.011220 0.274264 -0.172349
polarizability: 1.11151623e+02 7.33963115e+00 8.60187150e+01 -4.27143815e+00 -3.85871842e+00 5.60842248e+01
1716.lowfreq: -2.4339 0.0004 0.0004 0.0007 9.6090 14.5368 103.5875 148.1803 157.6334
frequency: 103.5514 148.1604 157.6325 194.9155 208.1410 227.9407 333.9819 388.1204 428.2325 529.7250 557.3675 608.8425 639.5433 703.0503 727.5350 794.7544 862.1387 888.1606 947.1566 965.1755 1000.9178 1003.9337 1018.5672 1044.8431 1084.6349 1119.1670 1175.3473 1204.3814 1232.0822 1257.1490 1275.7602 1305.3523 1329.4457 1333.3525 1361.5273 1387.2090 1432.7631 1452.7199 1467.7354 1478.5989 1481.7137 1641.8131 1649.7077 2987.1910 3004.8687 3009.9008 3024.4060 3082.8647 3084.7253 3092.6944 3097.5720 3117.1417 3142.8240 3227.0239
redmass: 3.5662 2.1043 3.8787 2.3648 1.6572 1.2373 2.7223 3.3972 2.9000 2.5887 2.9154 4.5151 3.6793 1.8038 2.4772 1.8200 1.3627 1.9241 1.9141 1.7406 1.1788 2.3046 2.2809 1.6281 1.6021 1.8047 1.4552 1.5962 2.6400 1.8165 1.4445 1.5441 1.4935 1.4610 1.9353 1.2140 1.2640 1.0804 1.0658 1.0853 1.0556 10.5562 4.9949 1.0359 1.0819 1.0651 1.0675 1.0995 1.1002 1.0994 1.1012 1.0604 1.0943 1.1139
irintensity: 1.7018 1.9373 0.0566 3.2185 3.5629 0.9513 2.2890 1.8628 3.4060 2.3715 4.4369 2.0074 12.4936 2.3204 2.5459 10.4195 94.4733 12.2753 1.0946 4.0273 22.2205 3.4451 12.8722 8.8275 2.3123 13.0264 2.3936 9.9696 101.6155 52.5471 25.3698 45.2000 42.5142 21.9447 141.5907 24.1324 22.2885 4.6863 8.0804 8.3954 5.7941 395.1949 88.5904 18.4706 12.3397 14.6710 37.5556 11.3086 33.1718 24.8402 26.6154 3.5190 6.3602 18.9088
temp: 298.150 k
press: 1.00000 atm
elementType: 8 7 6 6 6 6 6 6 6 1 1 1 1 1 1 1 1 1 1 1
symmnumber: 1
zpe: 442762.2 jmol-1
zpe.correction: 0.168639 hartree
zpe.thermalcorrener: 0.177621 hartree
zpe.thermalcorrenthalpy: 0.178566 hartree
zpe.thermalcorrgfe: 0.135176 hartree
zpe.sumelectzpe: -402.621091 hartree
zpe.sumelectthermal: -402.612109 hartree
zpe.sumelectthermalent: -402.611164 hartree
zpe.sumelectthermalfe: -402.654553 hartree
dipole: -0.2032 4.2449 -0.7383
dipole: 4.3134
quadrupole: -51.3153 -61.0336 -55.4739
quadrupole: -3.9526 0.6813 1.0176
quadrupole: 4.6256 -5.0927 0.4671 -3.9526 0.6813 1.0176
hfenergy: -402.7897299 hartree
pointgroup: C01 [X(C7H11N1O1)]
dipole: 0.0308123 -1.6758474 0.2654122 debye
dipolederiv: -0.5858829 0.0396119 -0.0021394 0.5287479 -1.1846439 0.1559196 -0.1205472 0.1624735 -0.3771338 -1.6555289 0.2949244 -0.1225742 -0.0554479 -0.7417677 0.0064338 -0.0258161 0.0673266 -0.2345329 0.145244 0.0507061 0.0111333 0.0330496 0.5815088 0.0545102 -0.036113 0.0135689 0.3375183 -0.0332045 0.0177813 0.0116504 0.0516401 0.0587582 0.0219486 -0.0064654 0.0027962 0.1088388 -0.2008393 -0.192785 0.0145445 -0.1832497 -0.1424626 0.0589839 -0.0287662 0.0353266 0.1151281 1.5009467 -0.3992134 0.1006148 -0.7344122 1.3872718 -0.252473 0.2541806 -0.2317988 0.1845001 0.00096 0.0079556 0.0458057 -0.0254507 -0.0486931 -0.068766 0.0658687 -0.0854694 -0.0802653 1.0733514 0.131569 0.1003886 0.4090316 0.1017552 0.008827 -0.0065249 -0.0056572 -0.0204418 -0.5003378 0.0373964 -0.0198742 0.1750533 0.0477682 -0.0692726 -0.0257997 -0.1058761 -0.4986386 -0.0249635 0.0757227 -0.1042185 0.0118294 -0.0093331 0.0106839 -0.0731443 0.0343955 -0.0770733 0.0513649 0.0220967 0.0185766 0.0298842 0.0677483 -0.0301037 0.0482467 0.0180826 -0.1560911 0.0424349 -0.0734844 -0.017815 -0.1002498 -0.1266629 -0.0232345 -0.0361727 -0.0630973 0.0720653 -0.0245592 0.0610728 0.0587373 0.0734076 0.0432047 -0.0322138 0.1074702 -0.0216297 0.0587203 0.0631392 -0.0017043 -0.0436296 -0.0535149 0.0546982 -0.0248091 -0.0811874 -0.0066886 -0.0813501 -0.0027812 0.0211587 -0.1282571 0.0601635 0.0676325 0.0485398 -0.0788868 0.0115574 -0.030956 -0.0978705 -0.0065685 0.0917403 -0.0444197 0.1116815 0.0175506 0.0510018 0.0112858 0.060938 0.1000037 -0.0272183 0.005925 -0.0172968 -0.1728145 0.0230773 0.0021177 0.0449483 0.063869 0.0889758 0.0330167 -0.0127102 -0.0696863 -0.0072654 0.0247635 -0.0031483 0.0349052 0.1663102 -0.0413715 -0.0791219 -0.0062729 -0.0926119 0.0228946 0.0200993 -0.0082255 0.0239604 0.1914415 0.1009186 -0.0129164 -0.0016254 0.0035327 -0.1112788 0.0495354 0.0019116 0.0595899 0.1971533 unknown
polarizability: 112.1092063|-5.7976475|85.2865162|3.5320366|-3.0580235|55.8588402 unknown
InChI: InChI=1S/C7H11NO/c1-3-8-6(2)4-5-7(8)9/h3,6H,1,4-5H2,2H3
charge 0 multiplicity 1
20 atoms
O  -0.982139 2.181016 -0.348748
N  0.32982 0.259352 0.094404
C  0.145661 -1.203622 0.304058
C  -1.36028 -1.298673 0.699752
C  -2.020518 -0.07214 0.022389
C  -0.885651 0.949261 -0.103593
C  0.489971 -2.013981 -0.966853
C  1.573053 0.913044 0.054384
C  2.792087 0.339721 0.248868
H  0.798724 -1.527016 1.136553
H  -1.464824 -1.223097 1.796586
H  -1.798146 -2.258212 0.378859
H  -2.85598 0.360578 0.595312
H  -2.402778 -0.303498 -0.98994
H  -0.207442 -1.769368 -1.788491
H  1.514577 -1.799575 -1.315682
H  0.413412 -3.096399 -0.758063
H  1.468518 1.985462 -0.148845
H  3.689606 0.961455 0.208644
H  2.932727 -0.72651 0.452906
