program: Gaussian 09
title: 000241480
version: EM64L-G09RevD.01
frameworkgroup: C1[X(C22H29NO2)]
method: RPBEPBE
basis: SDD
operation: Freq
keyword: #p
keyword: freq=noraman
keyword: PBEPBE/SDD
title: #p freq=noraman PBEPBE/SDD
converged: NO YES NO NO
title: Mulliken charges:
elementType: O O N C C C C C C C C C C C C C C C C C C C C C C H H H H H H H H H H H H H H H H H H H H H H H H H H H H H
charge: -0.440941 -0.438403 -0.169343 0.018364 -0.424801 -0.443141 -0.404649 -0.397440 -0.383661 -0.527013 -0.493025 0.348186 0.327169 -0.058108 -0.076553 -0.338761 -0.349117 0.323381 0.323784 -0.257522 -0.251009 -0.410710 -0.414974 -0.871043 -0.869876 0.208982 0.197264 0.218997 0.212124 0.184604 0.192431 0.189994 0.193752 0.194424 0.194596 0.187654 0.243025 0.231142 0.241475 0.222446 0.246871 0.257972 0.222697 0.222842 0.228221 0.227954 0.230659 0.249233 0.232728 0.248629 0.233457 0.229134 0.368052 0.367849
chargesum: 0.00000
title: Mulliken charges with hydrogens summed into heavy atoms:
elementType: O O N C C C C C C C C C C C C C C C C C C C C C C
charge: -0.072889 -0.070555 -0.169343 0.227345 -0.008539 -0.046413 -0.022224 -0.009265 -0.001411 -0.052846 -0.029104 0.348186 0.327169 -0.058108 -0.076553 -0.091891 -0.091145 0.323381 0.323784 -0.034825 -0.028167 -0.182489 -0.187021 -0.158423 -0.158657
polarizability: 3.03661362e+02 4.49155045e+00 2.16188235e+02 1.86201517e+00 -2.93949175e+01 2.27833409e+02
1716.lowfreq: -15.1218 -7.4647 -6.3521 -0.0008 -0.0005 0.0002 2.9609 11.9946 24.0837
frequency: -8.5680 10.5229 23.4586 31.1296 45.6534 51.2422 90.5363 102.2444 114.0713 136.4393 152.7522 161.1817 171.1469 184.6888 206.7649 213.6075 218.1280 262.2577 270.6600 284.7556 288.9013 296.5581 296.7998 303.2433 316.1681 321.9272 368.3023 383.7443 424.4443 447.1176 462.4423 469.4588 481.6938 494.8100 499.3712 517.8616 535.7427 539.5660 540.9382 545.5619 584.2107 594.4792 691.6063 713.8913 737.9652 743.6008 768.2436 778.9715 781.0449 782.4159 809.1922 810.7498 830.3035 847.8409 883.1856 893.5187 897.7569 903.8867 911.1696 913.8313 916.1824 956.8408 962.6713 969.6257 984.9183 988.7156 1005.6740 1013.6678 1041.6629 1042.3805 1043.0996 1054.4481 1068.7475 1076.3833 1083.3803 1086.9076 1110.4633 1125.6069 1146.7801 1153.8468 1156.9031 1172.8232 1174.0657 1185.7954 1199.4158 1206.5801 1234.4237 1240.4275 1251.8815 1255.2450 1258.5511 1267.0163 1270.1303 1277.3772 1298.8706 1302.3549 1325.0894 1328.9242 1333.9278 1336.3711 1343.4483 1355.4495 1366.8897 1369.2884 1390.0105 1392.3197 1396.3695 1398.8917 1441.0037 1446.4488 1456.4705 1458.4024 1460.0147 1461.5087 1462.0836 1466.7201 1473.7331 1475.6298 1477.4829 1479.0529 1482.9879 1487.7787 1491.6249 1601.6464 1603.6470 1620.2674 1622.4083 2925.3845 2943.5115 2948.8469 2949.0129 2959.8022 2962.0527 2963.0899 2964.0364 2965.4926 2978.2947 3007.6970 3015.3520 3016.0992 3019.8484 3020.2780 3023.1343 3031.3033 3035.1722 3044.2904 3085.0879 3085.2809 3119.8035 3120.6586 3137.4410 3139.7710 3157.2551 3161.0574 3578.4709 3581.0081
redmass: 4.3338 4.3912 3.9792 4.6857 3.1562 3.9600 3.8785 4.1659 4.3643 3.5218 1.0709 1.1023 3.5069 3.8397 2.4645 2.5080 2.0922 3.8523 3.3975 2.4618 2.2742 1.3925 1.5891 1.6997 2.1313 2.7758 3.0995 3.0452 3.1929 3.2439 2.4781 3.9051 3.3422 3.4226 2.8004 3.6109 3.6795 4.2029 4.1088 4.0905 4.5800 4.2609 4.6185 4.7593 4.0553 3.1406 2.1253 1.5651 1.4312 1.3156 5.1039 4.9605 3.4940 2.0329 1.8442 1.7288 2.0049 1.3813 2.0962 1.5090 1.9088 1.8379 1.4182 1.7405 1.5711 1.7031 1.9175 2.0328 1.5101 1.5047 1.7604 1.1569 1.4143 1.7234 2.3679 2.1274 2.4701 2.5545 1.4466 1.8145 1.8205 1.5847 1.5746 1.5401 2.2799 2.0321 1.2577 1.5528 1.4187 1.3630 1.3167 1.7714 2.3839 1.9708 1.4633 1.2954 1.3587 1.3459 1.3939 1.4626 1.4408 1.4672 1.4680 1.4454 3.5963 2.7950 1.5275 1.3367 2.3392 2.2695 1.1209 1.9682 1.1051 1.0996 2.3508 1.0830 1.1408 1.0964 1.0447 1.0449 1.1237 1.3427 1.3200 6.1777 6.1030 7.0998 7.0129 1.0685 1.0638 1.0403 1.0402 1.0617 1.0656 1.0635 1.0637 1.0650 1.0744 1.0947 1.0979 1.0978 1.0928 1.0933 1.0968 1.1004 1.1012 1.1019 1.0941 1.0941 1.0868 1.0874 1.0906 1.0904 1.0985 1.0988 1.0654 1.0653
irintensity: 0.0900 0.2975 0.4378 0.2085 0.1199 0.4487 0.2153 3.1724 0.1657 0.1677 0.0532 0.1403 0.9300 0.6212 9.4952 1.5902 4.0494 1.6305 0.7659 12.8365 12.4212 88.4670 35.9976 90.8391 0.8236 6.2977 0.7407 1.1055 2.9375 1.0013 1.0623 15.7945 0.1893 1.3846 0.3664 4.5787 1.5649 2.6590 2.9276 2.0562 1.4977 5.6636 2.8661 7.9884 5.8570 15.9073 4.5094 21.2462 7.1988 81.1657 5.4121 22.0863 3.5820 8.0817 10.8826 5.5698 5.5311 1.4305 19.4622 2.9954 8.7396 16.9862 3.8344 4.5771 3.7189 7.1562 10.8598 19.7242 5.2604 5.2659 0.8857 0.5218 2.1650 15.3504 31.8087 38.9035 0.6132 38.6517 88.6737 69.5035 94.6350 5.9335 54.0528 1.4217 7.6235 4.8354 3.4361 15.1997 18.6710 3.0002 4.0705 21.7703 4.5864 23.1462 18.3226 0.7045 12.2670 1.7484 1.4785 0.9664 0.3323 3.0743 3.7609 8.8945 3.0887 20.5388 27.7989 21.6746 21.5146 28.1419 0.4296 7.7171 5.1276 5.2345 20.8992 19.4645 18.6853 4.9997 14.6278 14.9591 15.7875 17.9243 14.1231 8.3295 10.0401 0.2073 0.0453 25.0348 25.2272 47.7478 42.8723 45.1731 19.0330 32.5999 25.7445 12.1065 61.2610 14.9938 24.3303 24.1294 46.3308 43.1842 82.1363 15.2235 24.8254 123.9477 13.9746 14.1776 9.0850 8.7427 14.3644 18.0972 23.6763 21.7191 24.0267 24.5150
temp: 298.150 k
press: 1.00000 atm
elementType: 8 8 7 6 6 6 6 6 6 6 6 6 6 6 6 6 6 6 6 6 6 6 6 6 6 1 1 1 1 1 1 1 1 1 1 1 1 1 1 1 1 1 1 1 1 1 1 1 1 1 1 1 1 1
symmnumber: 1
zpe: 1205070.4 jmol-1
zpe.correction: 0.458987 hartree
zpe.thermalcorrener: 0.483171 hartree
zpe.thermalcorrenthalpy: 0.484116 hartree
zpe.thermalcorrgfe: 0.404087 hartree
zpe.sumelectzpe: -1059.057269 hartree
zpe.sumelectthermal: -1059.033085 hartree
zpe.sumelectthermalent: -1059.032141 hartree
zpe.sumelectthermalfe: -1059.112169 hartree
dipole: 0.5183 -0.8398 -1.4063
dipole: 1.7180
quadrupole: -116.5431 -150.5853 -144.6923
quadrupole: -2.2119 1.5422 -1.0151
quadrupole: 20.7305 -13.3118 -7.4188 -2.2119 1.5422 -1.0151
hfenergy: -1059.5162566 hartree
pointgroup: C01 [X(C22H29N1O2)]
dipole: 0.1999152 -0.3626219 -0.5342255 debye
polarizability: 303.4175797|6.3339884|212.4631579|0.4404401|-28.4192102|231.8022683 unknown
InChI: InChI=1S/C22H29NO2/c1-16-8-6-10-18(21(16)24)14-23(20-12-4-3-5-13-20)15-19-11-7-9-17(2)22(19)25/h6-11,20,24-25H,3-5,12-15H2,1-2H3
charge 0 multiplicity 1
54 atoms
O  2.790243 -0.994614 -2.211592
O  -3.880315 0.544654 -1.880562
N  -0.112814 0.588619 -0.029843
C  0.911132 1.677113 0.027708
C  1.124022 2.455653 -1.304882
C  0.636165 2.659053 1.192678
C  2.266902 3.490655 -1.165873
C  1.778097 3.695593 1.329984
C  2.00575 4.465885 0.007057
C  0.335439 -0.615369 -0.793649
C  -1.467492 1.013928 -0.466199
C  1.543776 -1.294309 -0.165196
C  -2.570696 0.120655 0.099126
C  2.748635 -1.48973 -0.885941
C  -3.772886 -0.093758 -0.621338
C  1.485056 -1.771721 1.166157
C  -2.44458 -0.485719 1.370486
C  3.876884 -2.148143 -0.316988
C  -4.829118 -0.902442 -0.115038
C  2.58509 -2.425257 1.759805
C  -3.476553 -1.287379 1.9039
C  3.772451 -2.611448 1.014891
C  -4.65955 -1.493863 1.159124
C  5.147977 -2.33821 -1.127874
C  -6.096991 -1.111289 -0.926403
H  1.866483 1.164098 0.264276
H  0.18674 2.982365 -1.579296
H  1.357168 1.746881 -2.122592
H  0.51709 2.078826 2.127175
H  -0.31688 3.201731 1.022443
H  2.390754 4.052829 -2.112457
H  3.221972 2.953908 -0.985339
H  2.715058 3.171263 1.611193
H  1.549304 4.402184 2.151661
H  2.852132 5.172369 0.115323
H  1.105658 5.074762 -0.219855
H  0.550205 -0.381428 -1.858699
H  -0.515344 -1.324176 -0.783959
H  -1.571182 1.05035 -1.573756
H  -1.63668 2.047487 -0.109382
H  0.560061 -1.608862 1.729719
H  -1.510456 -0.315093 1.916578
H  2.521188 -2.790049 2.790433
H  -3.362278 -1.749483 2.890434
H  4.631194 -3.121605 1.467978
H  -5.464223 -2.118676 1.565411
H  5.599998 -1.373239 -1.437547
H  5.909997 -2.869505 -0.534214
H  4.976826 -2.941453 -2.043231
H  -6.799566 -1.764704 -0.383394
H  -6.631012 -0.159496 -1.125261
H  -5.898443 -1.59915 -1.903273
H  3.673931 -1.17068 -2.61931
H  -4.723816 0.28749 -2.3287
