program: Gaussian 09
title: 000241472
version: EM64L-G09RevD.01
frameworkgroup: C1[X(C28H23NO2)]
method: RPBEPBE
basis: SDD
operation: Freq
keyword: #p
keyword: freq=noraman
keyword: PBEPBE/SDD
title: #p freq=noraman PBEPBE/SDD
converged: YES YES NO NO
title: Mulliken charges:
elementType: O O N C C C C C C C C C C C C C C C C C C C C C C C C C C C C H H H H H H H H H H H H H H H H H H H H H H H
charge: -0.442927 -0.436714 -0.166468 -0.609041 -0.551727 0.264209 0.263260 0.214325 0.195291 0.467778 0.434301 0.439618 0.118774 0.166420 -0.374116 -0.408577 -0.468934 -0.463394 -0.423070 -0.424865 -0.402694 -0.356349 -0.451344 -0.439682 -0.273240 -0.270503 -0.249188 -0.253205 -0.239161 -0.239995 -0.283033 0.301568 0.220373 0.265972 0.230424 0.276116 0.234442 0.238627 0.238333 0.214976 0.213971 0.221639 0.249934 0.238908 0.239487 0.231142 0.226352 0.227359 0.228779 0.214230 0.217672 0.221313 0.356520 0.356115
chargesum: 0.00000
title: Mulliken charges with hydrogens summed into heavy atoms:
elementType: O O N C C C C C C C C C C C C C C C C C C C C C C C C C C C C
charge: -0.086407 -0.080600 -0.166468 -0.087100 -0.055330 0.264209 0.263260 0.214325 0.195291 0.467778 0.434301 0.439618 0.118774 0.166420 -0.098001 -0.174135 -0.230307 -0.225061 -0.208094 -0.210894 -0.181056 -0.106415 -0.212437 -0.200194 -0.042097 -0.044151 -0.021828 -0.024426 -0.024931 -0.022323 -0.061720
polarizability: 3.51548017e+02 3.18415649e+00 3.23939714e+02 -8.06799706e+00 1.88833169e+01 3.01953461e+02
1716.lowfreq: -0.0006 0.0004 0.0008 1.8091 2.7345 6.3959 12.5911 23.1645 26.8489
frequency: 12.2108 23.0707 26.7823 33.7965 50.2957 63.8618 79.0808 90.8468 101.8301 127.6216 135.4257 162.2419 183.4098 188.9467 220.5030 223.1727 266.3641 287.3330 297.3579 308.8595 312.5315 320.5913 337.2611 359.3768 369.4557 410.3405 413.2427 415.5833 427.4267 428.4329 453.4263 467.7773 476.3226 510.7448 515.0827 517.5031 523.4555 530.9633 531.8655 552.5567 568.9099 601.7103 614.2679 628.2573 658.6106 666.7105 688.3957 693.2050 701.6170 718.8058 737.3663 745.2254 751.2585 753.2623 757.5810 786.0083 789.6323 804.7885 806.8582 810.3471 841.7233 855.2963 862.1087 870.9102 878.9455 880.5159 891.5611 935.2102 938.9433 951.4297 961.1241 964.8565 969.6571 970.5851 975.6711 981.8485 987.9555 996.5348 1023.9537 1031.8468 1035.0352 1046.0027 1049.2556 1053.6650 1088.1203 1139.8372 1146.9147 1155.6906 1163.3217 1166.6350 1170.6375 1175.6103 1176.9273 1199.2840 1199.5468 1211.4463 1229.0744 1234.1654 1238.4189 1244.4621 1251.6897 1268.5758 1278.6832 1285.4976 1331.2402 1332.1957 1352.1888 1368.1824 1372.3105 1379.6571 1397.8088 1403.7609 1405.6608 1424.7923 1426.5648 1434.7300 1435.8244 1447.8194 1468.2687 1469.6240 1473.7147 1489.0547 1507.7792 1517.5523 1517.9989 1572.7368 1589.3672 1590.3854 1608.4859 1610.4226 1617.3282 1635.0827 1636.5189 2993.1392 3035.0424 3047.3084 3095.9703 3106.9318 3107.5027 3117.4433 3118.7062 3119.3382 3125.1575 3130.4143 3134.5043 3141.5851 3143.0549 3149.2510 3149.5593 3153.9482 3161.1044 3163.5799 3168.0912 3177.5599 3578.5493 3586.4654
redmass: 6.0321 5.5005 5.1099 5.4555 4.7564 3.9060 4.9937 5.5081 6.1286 4.5594 4.5614 4.6897 4.9003 4.7969 4.4563 4.3230 2.5238 3.6090 4.1478 1.4275 1.7138 1.6803 4.6000 4.4224 2.6246 2.9747 3.3029 3.3723 6.9903 6.7280 4.2564 3.4893 3.7564 3.3189 3.6131 4.7114 4.2546 3.4635 3.5098 4.1196 4.5278 4.6433 6.3014 4.6092 3.9645 4.3752 1.9096 5.2033 4.8980 5.3135 4.1934 4.2286 1.9279 1.3781 1.3383 3.2942 3.1867 1.4336 1.4140 1.3915 3.6660 4.9017 1.5187 1.6567 1.9085 2.7590 3.1301 1.3402 1.3447 1.3666 2.2677 1.8555 1.4324 1.3959 4.3943 2.6727 1.3482 1.3331 2.9140 2.1985 2.2400 3.0875 2.7031 2.6551 1.7990 1.7282 1.4838 1.7269 1.1937 1.2587 1.1044 1.1658 1.1372 1.4728 1.1578 1.5112 1.8274 1.7785 3.3611 3.8404 1.5338 1.8235 1.5639 1.5167 1.4998 1.5849 1.5219 2.1883 1.9178 4.2688 1.8215 2.9063 3.2206 3.2839 3.8161 3.1563 3.1532 2.6240 1.9554 2.2816 1.4468 1.3151 1.9043 3.7143 3.6319 5.8282 7.6205 7.6775 5.6780 5.6438 6.0296 6.6351 6.6720 1.0619 1.0606 1.0976 1.1002 1.0876 1.0877 1.0844 1.0868 1.0865 1.0890 1.0880 1.0895 1.0964 1.0964 1.0934 1.0918 1.0951 1.0972 1.0999 1.0984 1.0942 1.0660 1.0661
irintensity: 0.0745 0.3231 0.7723 0.3146 0.0972 0.1099 0.3338 0.6453 0.1691 1.1021 0.3509 0.5131 3.7626 2.3510 12.7532 9.1201 3.6894 5.1569 10.9026 82.9559 36.4011 71.1150 4.6899 2.0236 13.3500 0.3138 5.6847 2.2384 1.9332 2.8873 11.4376 14.6872 8.6012 5.0074 6.3752 5.6266 6.4849 1.2430 0.4993 5.1811 9.9332 6.1960 0.6181 2.9250 0.2502 8.1633 44.7817 11.4282 0.9859 9.1864 6.3359 12.7452 56.5995 41.1078 15.1149 7.6709 9.7041 53.1017 66.3181 42.2735 7.2823 8.4170 7.0119 2.5794 0.3766 7.9929 6.1861 1.2467 1.5572 0.4353 30.2217 38.1171 7.6779 9.4222 21.9162 82.3957 1.6493 1.5668 25.5931 11.5928 5.9688 34.5921 3.4798 62.8997 4.9349 10.5159 38.2501 45.5829 19.2346 59.3780 17.5441 1.1784 4.2265 11.8615 8.3940 36.4621 34.9607 31.8235 86.3442 93.5438 58.7154 9.0274 2.7551 14.5262 23.6278 37.1093 6.7832 22.2303 9.0947 8.9815 14.3704 7.4592 10.9268 15.2347 5.5239 6.4359 7.3018 0.2944 7.4925 5.9631 13.6044 70.9160 108.6248 34.3024 41.8647 9.5436 5.9963 6.2586 17.3716 7.6548 166.5015 27.6245 40.5815 34.2110 19.6378 2.3109 4.3019 13.5091 12.1642 8.9754 2.8944 4.2133 14.9345 4.8635 15.8489 27.6032 20.0923 48.9241 35.5534 21.7287 27.3555 27.1561 19.2351 3.2374 42.8783 42.3377
temp: 298.150 k
press: 1.00000 atm
elementType: 8 8 7 6 6 6 6 6 6 6 6 6 6 6 6 6 6 6 6 6 6 6 6 6 6 6 6 6 6 6 6 1 1 1 1 1 1 1 1 1 1 1 1 1 1 1 1 1 1 1 1 1 1 1
symmnumber: 1
zpe: 1127720.9 jmol-1
zpe.correction: 0.429526 hartree
zpe.thermalcorrener: 0.455058 hartree
zpe.thermalcorrenthalpy: 0.456002 hartree
zpe.thermalcorrgfe: 0.372512 hartree
zpe.sumelectzpe: -1283.845566 hartree
zpe.sumelectthermal: -1283.820035 hartree
zpe.sumelectthermalent: -1283.819091 hartree
zpe.sumelectthermalfe: -1283.902581 hartree
dipole: 0.1765 -3.8391 -0.9961
dipole: 3.9702
quadrupole: -162.3732 -168.3338 -162.8804
quadrupole: 4.1494 -7.2489 6.1564
quadrupole: 2.1559 -3.8047 1.6488 4.1494 -7.2489 6.1564
hfenergy: -1284.2750926 hartree
pointgroup: C01 [X(C28H23N1O2)]
dipole: -0.1690259 1.5280335 0.2762645 debye
polarizability: 351.736289|0.6353455|334.4473605|8.1957705|-3.3839825|291.2575422 unknown
InChI: InChI=1S/C28H23NO2/c30-27-16-14-20-8-4-6-12-23(20)25(27)18-29(22-10-2-1-3-11-22)19-26-24-13-7-5-9-21(24)15-17-28(26)31/h1-17,30-31H,18-19H2
charge 0 multiplicity 1
54 atoms
O  1.512606 3.532722 -0.305894
O  -1.574225 1.962471 -1.907577
N  0.245786 0.034827 -0.822959
C  1.3097 0.914679 -1.360433
C  -0.522122 0.588124 0.314469
C  2.37879 1.279462 -0.326812
C  -2.034117 0.706565 0.097849
C  3.338326 0.312458 0.15601
C  -3.00099 0.179329 1.035759
C  -0.051487 -1.226995 -1.362473
C  4.354322 0.713697 1.112766
C  -4.42352 0.335547 0.773908
C  2.46119 2.593716 0.161218
C  -2.516609 1.394282 -1.029133
C  3.334204 -1.056298 -0.283148
C  -2.629585 -0.508141 2.245723
C  4.387181 2.071013 1.569768
C  -4.848291 1.019421 -0.40899
C  3.459114 2.997515 1.104513
C  -3.913099 1.544742 -1.294153
C  0.439946 -1.647904 -2.640672
C  -0.86341 -2.159063 -0.638774
C  5.310512 -0.245424 1.582267
C  -5.385914 -0.190359 1.696839
C  4.280633 -1.968488 0.19128
C  -3.590344 -1.007614 3.128256
C  5.279797 -1.566126 1.131939
C  -4.985289 -0.852712 2.857063
C  0.148985 -2.931588 -3.147245
C  -1.150827 -3.434578 -1.161412
C  -0.646442 -3.844368 -2.417906
H  0.850613 1.839817 -1.747658
H  1.80191 0.405413 -2.202812
H  -0.118316 1.600939 0.491724
H  -0.311818 0.005734 1.230492
H  2.572428 -1.399798 -0.988316
H  -1.573406 -0.637859 2.500221
H  5.154545 2.37286 2.291897
H  -5.920496 1.128566 -0.607294
H  3.486174 4.037278 1.457273
H  -4.2396 2.077529 -2.197322
H  1.019639 -0.964683 -3.268807
H  -1.269676 -1.893607 0.339692
H  6.070769 0.078915 2.303389
H  -6.451441 -0.06016 1.471514
H  4.253476 -3.006541 -0.158261
H  -3.271036 -1.524961 4.039938
H  6.013535 -2.294362 1.494281
H  -5.7273 -1.251294 3.557028
H  0.541394 -3.211776 -4.13244
H  -1.775177 -4.117504 -0.572647
H  -0.872427 -4.83815 -2.818089
H  1.677971 4.420622 0.096504
H  -2.03078 2.405214 -2.665254
