program: Gaussian 09
title: 000241462
version: EM64L-G09RevD.01
frameworkgroup: C1[X(C15H13Cl4NO2)]
method: RPBEPBE
basis: SDD
operation: Freq
keyword: #p
keyword: freq=noraman
keyword: PBEPBE/SDD
title: #p freq=noraman PBEPBE/SDD
converged: YES YES NO NO
title: Mulliken charges:
elementType: Cl Cl Cl Cl O O N C C C C C C C C C C C C C C C H H H H H H H H H H H H H
charge: -0.059795 -0.059796 -0.010648 -0.010651 -0.383988 -0.383987 -0.116986 -0.480150 -0.480151 0.522148 0.522161 -0.638468 -0.370938 -0.370946 -0.492559 -0.492552 -0.241794 -0.241793 -0.244952 -0.244945 0.449910 0.449909 0.197440 0.229755 0.229750 0.197446 0.249393 0.195265 0.249397 0.286242 0.286240 0.264076 0.264075 0.365945 0.365945
chargesum: 0.00000
title: Mulliken charges with hydrogens summed into heavy atoms:
elementType: Cl Cl Cl Cl O O N C C C C C C C C C C C C C C C
charge: -0.059795 -0.059796 -0.010648 -0.010651 -0.018042 -0.018042 -0.116986 -0.052954 -0.052955 0.522148 0.522161 0.055587 -0.084696 -0.084706 -0.228483 -0.228476 -0.241794 -0.241793 -0.244952 -0.244945 0.449910 0.449909
polarizability: 3.13534622e+02 6.94205775e-04 2.49499637e+02 1.27426888e-03 5.26455231e+00 1.01655741e+02
1716.lowfreq: -0.0012 0.0012 0.0017 1.5722 2.2648 4.3292 11.0591 13.8459 21.1025
frequency: 10.9504 13.8204 21.0331 56.6724 81.2027 81.9716 100.9131 101.3913 137.0457 170.8195 175.1246 189.7323 196.8056 204.7918 208.2799 234.4455 250.8959 254.3513 287.7357 303.3772 338.3658 345.4863 352.0921 352.2611 356.1212 397.4893 414.8650 446.6675 447.1366 447.5442 492.0921 493.3695 522.2483 541.4853 558.6340 566.0730 595.0672 640.0021 715.2702 715.8146 740.5702 740.9987 764.3841 784.5746 826.5782 858.6157 871.2889 896.3445 905.5191 914.2971 921.5754 977.6412 996.4445 1036.1679 1046.4702 1047.4439 1118.4614 1138.9786 1140.1185 1148.8934 1179.0475 1190.7780 1197.5718 1226.3305 1231.2088 1269.9169 1272.9953 1288.4349 1300.7439 1325.1109 1366.4385 1389.2826 1393.0623 1401.3006 1404.8893 1437.2192 1455.1312 1469.5729 1475.1870 1478.2046 1480.1614 1482.3994 1569.5756 1571.0924 1609.9070 1610.3336 2849.4204 2861.0630 2883.8376 2986.4323 2989.8846 3045.7734 3100.6953 3154.0991 3154.1085 3167.3098 3168.6249 3495.4382 3495.5668
redmass: 20.7028 9.2443 9.7651 4.9843 3.3705 9.0508 12.7479 13.1402 17.1929 6.1162 4.5599 6.3495 10.5197 4.7476 5.1519 1.0972 5.7105 5.8016 6.1790 3.7795 5.1712 5.9082 6.6671 16.9697 2.7176 3.7531 5.6645 1.1235 1.1014 4.6852 5.4836 5.5186 5.3293 5.2165 3.7638 4.4570 5.4459 4.5470 5.3950 5.6209 9.1863 9.0656 5.4898 5.2388 3.3927 1.4561 1.5881 4.0915 1.5082 1.3362 5.0236 1.7553 2.0704 2.1465 2.7740 2.9401 1.3124 1.5021 1.5339 2.7622 1.3918 1.9469 1.8731 1.5822 1.6512 1.7806 1.8542 2.2072 2.1114 1.6751 1.9926 4.5336 4.7534 3.2679 2.1614 1.1911 1.1228 1.2939 3.8523 1.9314 1.0558 1.2349 6.6768 6.5483 8.2945 8.2021 1.0702 1.0699 1.0557 1.0881 1.0858 1.0743 1.1012 1.0925 1.0925 1.0920 1.0916 1.0648 1.0649
irintensity: 0.0030 0.1378 0.0731 0.7148 0.5878 0.0309 0.0013 0.0048 0.1618 2.1989 2.2733 0.0048 0.0834 0.1963 1.3514 2.4390 1.8376 1.2323 7.3695 3.9203 1.0323 4.4057 1.3582 6.1949 11.6675 0.9401 4.2885 10.2535 272.5968 0.6058 1.0600 0.8990 50.8287 7.1200 0.8645 11.8099 6.1255 2.6028 0.5933 12.9282 132.7742 77.4012 15.9876 15.0219 8.8140 8.0697 43.2265 4.9746 1.5027 11.9071 8.9417 8.7764 14.2349 89.5850 0.6194 0.1883 3.8979 55.7746 186.7448 13.7957 0.0135 102.9187 15.6072 197.8705 164.8474 21.1433 18.2879 7.4274 13.8456 43.4829 7.3560 102.4049 8.0375 76.9333 9.0550 9.6630 6.0903 26.0442 165.0409 38.8774 1.7178 2.0465 16.5042 48.9632 0.3105 0.0067 38.2847 117.9042 119.7889 3.6817 39.2962 18.8723 29.0527 0.1291 1.3650 2.3999 1.1212 147.4134 6.2916
temp: 298.150 k
press: 1.00000 atm
elementType: 17 17 17 17 8 8 7 6 6 6 6 6 6 6 6 6 6 6 6 6 6 6 1 1 1 1 1 1 1 1 1 1 1 1 1
symmnumber: 1
zpe: 646718.9 jmol-1
zpe.correction: 0.246322 hartree
zpe.thermalcorrener: 0.268375 hartree
zpe.thermalcorrenthalpy: 0.269319 hartree
zpe.thermalcorrgfe: 0.191511 hartree
zpe.sumelectzpe: -2623.206929 hartree
zpe.sumelectthermal: -2623.184876 hartree
zpe.sumelectthermalent: -2623.183932 hartree
zpe.sumelectthermalfe: -2623.261741 hartree
dipole: -0.0001 -5.6451 -0.3316
dipole: 5.6548
quadrupole: -154.1183 -160.7751 -156.7337
quadrupole: 0.0000 0.0007 1.3756
quadrupole: 3.0907 -3.5661 0.4753 0.0000 0.0007 1.3756
hfenergy: -2623.4532515 hartree
pointgroup: C01[X(C15H13Cl4N1O2)]
dipole: 0.000023 -2.2184673 0.1672718 debye
polarizability: 313.5346221|-0.0013872|249.2844081|0.0021589|-7.7129433|101.8709706 unknown
InChI: InChI=1S/C15H13Cl4NO2/c1-20(6-8-2-10(16)14(21)11(17)3-8)7-9-4-12(18)15(22)13(19)5-9/h2-5,21-22H,6-7H2,1H3
charge 0 multiplicity 1
35 atoms
Cl 6.501422 -1.406656 -0.211986
Cl -6.501184 -1.406493 -0.2122
Cl 3.410554 3.200015 0.021106
Cl -3.410216 3.200088 0.021331
O  5.919476 1.599595 -0.289652
O  -5.919168 1.599751 -0.289606
N  0.00013 -1.087581 0.131824
C  1.23254 -1.613738 0.760591
C  -1.23233 -1.613784 0.760459
C  2.470521 -0.783396 0.433527
C  -2.470279 -0.783379 0.433432
C  0.000222 -1.23444 -1.341162
C  2.389218 0.629265 0.358883
C  -2.388944 0.629286 0.358913
C  3.726377 -1.409518 0.256129
C  -3.726147 -1.409458 0.255961
C  4.860603 -0.617013 0.022841
C  -4.86035 -0.616908 0.022719
C  3.538624 1.396913 0.117304
C  -3.538329 1.39698 0.117377
C  4.812457 0.797143 -0.05488
C  -4.812172 0.797254 -0.054883
H  1.430315 -2.679126 0.478699
H  1.072898 -1.603071 1.857893
H  -1.07275 -1.603244 1.857771
H  -1.430113 -2.679137 0.478438
H  -0.892434 -0.744895 -1.764513
H  0.000257 -2.304905 -1.663165
H  0.892919 -0.744871 -1.764399
H  1.414794 1.11149 0.478225
H  -1.414512 1.111478 0.478322
H  3.819595 -2.499218 0.298788
H  -3.819391 -2.499159 0.298527
H  6.732692 1.035674 -0.391096
H  -6.732395 1.035856 -0.391117
