program: Gaussian 09
title: 000241461
version: EM64L-G09RevD.01
frameworkgroup: C1[X(C15H13Br4NO2)]
method: RPBEPBE
basis: SDD
operation: Freq
keyword: #p
keyword: freq=noraman
keyword: PBEPBE/SDD
title: #p freq=noraman PBEPBE/SDD
converged: YES YES NO NO
title: Mulliken charges:
elementType: Br Br Br Br O O N C C C C C C C C C C C C C C C H H H H H H H H H H H H H
charge: 0.039600 0.035085 0.039839 -0.000630 -0.415310 -0.408946 -0.272034 -0.469376 -0.472386 0.362257 0.337644 -0.604521 0.237725 0.272448 -0.250330 -0.379112 -0.405061 -0.388716 -0.270404 -0.227854 -0.175223 -0.163462 0.269092 0.238605 0.247765 0.230290 0.258407 0.222426 0.254510 0.276608 0.254751 0.275687 0.269349 0.360459 0.420816
chargesum: 0.00000
title: Mulliken charges with hydrogens summed into heavy atoms:
elementType: Br Br Br Br O O N C C C C C C C C C C C C C C C
charge: 0.039600 0.035085 0.039839 -0.000630 -0.054850 0.011870 -0.272034 0.038321 0.005669 0.362257 0.337644 0.130822 0.237725 0.272448 0.026278 -0.124361 -0.405061 -0.388716 -0.270404 -0.227854 0.100464 0.105888
polarizability: 3.34820738e+02 6.31089177e+00 2.97677730e+02 -1.24399835e+01 -8.98692061e+00 1.15203220e+02
1716.lowfreq: -1.8393 -0.0006 -0.0005 -0.0004 1.8679 3.4461 10.9803 12.6693 20.7853
frequency: 10.8795 12.3380 20.7767 51.0163 66.2813 77.9111 89.3442 105.4450 119.8608 128.8082 138.7210 144.3359 157.3240 196.1033 209.7438 224.3941 231.3871 237.0132 267.0016 275.2387 311.0567 315.7782 328.7068 342.6472 345.5150 353.1232 436.6338 447.6355 450.2749 478.9686 500.9389 515.7073 547.4420 552.8921 554.4487 602.4720 641.3891 652.9461 661.8455 726.3160 742.2412 798.2029 803.3046 826.3090 859.4577 868.4478 874.5561 881.7992 895.8914 909.5035 961.1704 979.6330 992.6127 1079.2339 1087.0332 1105.5023 1117.0723 1118.9250 1137.7508 1167.7311 1207.2330 1218.5996 1222.0430 1223.3901 1246.6900 1262.1708 1280.6389 1307.2850 1324.8248 1343.9130 1367.8463 1376.4622 1396.8978 1398.9709 1423.4316 1433.0851 1443.7662 1454.1292 1470.1640 1476.5076 1476.9350 1511.8771 1572.9872 1579.0553 1590.6701 1601.2222 2164.1903 2954.0286 2960.2739 2983.1581 3013.3899 3041.8501 3072.4417 3113.6899 3147.2474 3156.1447 3181.1470 3183.6499 3482.2110
redmass: 30.0062 18.7456 12.0327 6.8945 8.3023 4.8181 18.0363 8.5757 14.8665 7.8021 9.2898 5.9809 5.9807 1.5840 4.7007 2.0301 4.0323 7.0269 7.0769 7.0618 5.9760 6.7904 6.0645 5.6035 3.8794 3.1050 3.2046 3.7301 1.1139 4.3557 4.4155 4.3441 4.9020 4.0989 3.8175 6.1329 6.0955 8.5012 8.2200 5.8429 5.8788 6.4513 6.5109 4.0477 4.5933 1.3997 1.4553 1.4995 4.6893 1.4838 1.8620 1.9669 2.3281 1.9711 1.9141 2.8469 1.5732 2.0697 4.5335 1.3945 1.8422 1.5094 1.2974 2.0243 1.4307 2.3527 1.6264 1.4935 1.3791 4.3970 1.9660 2.9064 3.5176 4.6139 1.2437 2.4550 3.2998 1.1600 1.0520 1.0631 1.1077 2.2213 7.3438 3.0257 7.0344 3.1672 1.0728 1.0579 1.0443 1.0581 1.1029 1.1039 1.0896 1.1019 1.0925 1.0932 1.0930 1.0937 1.0650
irintensity: 0.1554 0.1530 0.1171 1.0423 0.1518 2.6177 0.0407 0.2376 0.5293 0.3784 2.2243 2.3213 0.1005 0.6702 0.6277 2.9532 4.3746 2.5140 6.9016 2.2570 3.7620 0.3370 0.1979 2.4005 4.0914 2.2669 55.6886 1.2406 129.9273 1.5202 3.0750 16.7545 16.9819 14.0463 5.4625 5.5251 29.6131 104.3712 48.0605 25.0849 9.4312 9.0635 4.3304 52.5125 52.1505 18.9632 25.8238 4.2593 2.1178 10.2155 27.5744 17.2226 48.4259 41.6247 6.1332 7.1254 15.8485 105.7637 134.3388 19.0197 26.5322 19.0788 43.8050 62.4961 15.8236 28.2310 68.5920 15.3104 12.2091 44.2233 35.5458 55.9900 39.1788 15.4141 91.3705 243.9268 122.2546 53.5426 0.7167 20.5705 35.8470 153.8758 21.2259 6.1551 3.0255 168.9891 1910.3862 26.3001 34.2549 24.7305 15.6615 7.2984 13.7776 20.4962 3.2546 0.2617 0.0120 0.5101 76.6606
temp: 298.150 k
press: 1.00000 atm
elementType: 35 35 35 35 8 8 7 6 6 6 6 6 6 6 6 6 6 6 6 6 6 6 1 1 1 1 1 1 1 1 1 1 1 1 1
symmnumber: 1
zpe: 642402.2 jmol-1
zpe.correction: 0.244678 hartree
zpe.thermalcorrener: 0.267207 hartree
zpe.thermalcorrenthalpy: 0.268151 hartree
zpe.thermalcorrgfe: 0.187092 hartree
zpe.sumelectzpe: -836.824872 hartree
zpe.sumelectthermal: -836.802344 hartree
zpe.sumelectthermalent: -836.801399 hartree
zpe.sumelectthermalfe: -836.882459 hartree
dipole: 4.9052 -5.1078 0.6624
dipole: 7.1126
quadrupole: -175.0192 -163.0023 -166.2134
quadrupole: -5.2917 -2.9529 -2.0482
quadrupole: -6.9409 5.0760 1.8649 -5.2917 -2.9529 -2.0482
hfenergy: -837.0695502 hartree
pointgroup: C01 [X(C15H13Br4N1O2)]
dipole: 2.1334824 -1.7357145 0.5159302 debye
polarizability: 333.3712116|9.5584324|294.5093447|-7.9671199|-31.6269677|119.8211312 unknown
InChI: InChI=1S/C15H13Br4NO2/c1-20(6-8-2-10(16)4-12(18)14(8)21)7-9-3-11(17)5-13(19)15(9)22/h2-5,21-22H,6-7H2,1H3
charge 0 multiplicity 1
35 atoms
Br 6.336323 -0.792364 -0.633535
Br -3.845084 2.949835 -1.081491
Br 3.142536 4.060334 -0.248838
Br -6.486743 -2.149369 -0.176254
O  3.669561 -2.039889 0.524177
O  -1.401723 1.344692 0.034141
N  -0.010912 -0.751905 0.390287
C  1.210105 -0.819383 1.260335
C  -1.228716 -1.305833 1.08859
C  2.366346 -0.015779 0.68468
C  -2.512749 -0.784397 0.454911
C  0.201124 -1.382774 -0.945385
C  3.58667 -0.65859 0.340746
C  -2.545005 0.577369 0.002672
C  2.24786 1.38265 0.503562
C  -3.670912 -1.586257 0.389678
C  4.657167 0.120464 -0.1694
C  -3.776023 1.098275 -0.475324
C  3.327072 2.127846 -0.009219
C  -4.87193 -1.032396 -0.095267
C  4.548694 1.510248 -0.351931
C  -4.942756 0.308605 -0.525574
H  1.522663 -1.870658 1.413948
H  0.927758 -0.398876 2.244076
H  -1.173462 -0.957451 2.139602
H  -1.214507 -2.415739 1.101044
H  -0.722166 -1.288829 -1.540029
H  0.465938 -2.456493 -0.851907
H  1.013395 -0.858614 -1.473896
H  1.310299 1.884112 0.764504
H  -3.636911 -2.627349 0.727196
H  5.386063 2.090325 -0.745963
H  -5.878063 0.731656 -0.899649
H  4.568195 -2.372008 0.256444
H  -0.600708 0.629339 0.180567
