program: Gaussian 09
title: 000241457
version: EM64L-G09RevD.01
frameworkgroup: C1[X(C13H11Cl2NO)]
method: RPBEPBE
basis: SDD
operation: Freq
keyword: #p
keyword: freq=noraman
keyword: PBEPBE/SDD
title: #p freq=noraman PBEPBE/SDD
converged: YES YES NO NO
title: Mulliken charges:
elementType: Cl Cl O N C C C C C C C C C C C C C H H H H H H H H H H H
charge: -0.053859 -0.007058 -0.383126 -0.441166 -0.487587 0.492446 0.474592 -0.384975 -0.480895 -0.243879 -0.242611 0.457488 -0.364701 -0.423524 -0.225870 -0.196445 -0.272418 0.222687 0.227112 0.295401 0.291539 0.267078 0.229650 0.216993 0.219155 0.220941 0.225999 0.367033
chargesum: 0.00000
title: Mulliken charges with hydrogens summed into heavy atoms:
elementType: Cl Cl O N C C C C C C C C C C C C C
charge: -0.053859 -0.007058 -0.016093 -0.145764 -0.037788 0.492446 0.474592 -0.093436 -0.213817 -0.243879 -0.242611 0.457488 -0.135051 -0.206532 -0.006715 0.024496 -0.046419
polarizability: 2.64830782e+02 8.99275793e+00 1.63923981e+02 -1.11652426e+01 1.37520673e+01 9.98196339e+01
1716.lowfreq: -4.8047 0.0022 0.0023 0.0025 3.8604 6.9765 20.0493 27.2610 46.8995
frequency: 19.8751 27.1771 46.8743 96.3487 101.8534 143.7280 171.4324 200.8183 203.1845 215.4588 229.6603 283.0498 338.9480 353.2080 394.3782 408.6955 414.5343 445.6890 464.4893 493.3171 501.1884 506.5184 548.1377 578.1823 614.1503 630.0978 690.6430 714.3368 744.6905 754.4940 771.6546 813.1069 831.6068 864.7784 871.1304 899.8256 913.3823 954.8486 974.8566 977.6611 997.9284 1023.6727 1048.6799 1077.5072 1114.6442 1142.6152 1170.0865 1188.3802 1199.8744 1215.6176 1233.3179 1275.9139 1294.8573 1328.3659 1345.1482 1385.3235 1389.2344 1401.5286 1431.3261 1476.8921 1481.8198 1490.6944 1506.5182 1568.7744 1590.2556 1610.1504 1624.2060 2914.7081 2978.4758 3110.7098 3125.1133 3137.9816 3151.4557 3159.6146 3164.9997 3167.2416 3494.1808 3555.3542
redmass: 5.9244 4.5721 5.4465 4.9497 11.3814 7.2940 7.4495 4.0127 5.0743 6.7664 4.1303 6.2993 5.2233 17.4075 5.2195 2.8992 1.4176 1.1041 3.0797 5.1411 6.1374 2.8358 4.3207 4.1008 6.3938 5.9041 1.8474 5.4161 9.0723 1.8055 5.5381 1.2738 3.7699 1.5388 1.5057 1.4112 4.5456 1.3664 1.2987 5.7446 1.7339 2.2453 3.0784 1.9644 2.8408 1.5221 1.0481 1.1091 1.6038 1.2415 1.7279 1.7094 2.3665 1.5251 1.8075 4.4472 3.7318 3.2951 2.3001 3.3171 1.8908 1.2005 2.3269 6.5745 5.2272 8.0554 6.2465 1.0669 1.0924 1.0872 1.0858 1.0926 1.0939 1.0927 1.0927 1.1009 1.0649 1.0767
irintensity: 0.1467 0.0802 0.6680 2.1324 0.1788 0.5679 2.2819 1.2084 0.5687 0.2944 0.6279 8.4925 2.8453 4.6994 7.3822 0.6618 153.1742 140.4492 31.0786 2.1354 16.5084 9.9059 12.0828 8.3754 0.6737 3.4732 41.0648 7.0155 75.6724 85.9900 31.4661 0.6080 7.7249 21.5215 12.3156 5.1197 6.5028 0.0590 0.6423 4.4302 10.6724 7.1235 1.3737 7.7174 14.2157 167.4527 1.2606 4.5387 1.5751 62.3289 151.7751 30.9990 28.1461 59.7106 10.9821 20.1924 91.4536 46.3052 30.3082 139.5978 14.5948 27.0634 198.1192 39.2692 8.8174 0.4836 229.7151 66.2162 19.2176 14.7803 5.7239 26.6573 46.1123 0.4574 0.0358 14.9377 78.1468 27.1547
temp: 298.150 k
press: 1.00000 atm
elementType: 17 17 8 7 6 6 6 6 6 6 6 6 6 6 6 6 6 1 1 1 1 1 1 1 1 1 1 1
symmnumber: 1
zpe: 542992.0 jmol-1
zpe.correction: 0.206815 hartree
zpe.thermalcorrener: 0.222467 hartree
zpe.thermalcorrenthalpy: 0.223411 hartree
zpe.thermalcorrgfe: 0.161364 hartree
zpe.sumelectzpe: -1550.861742 hartree
zpe.sumelectthermal: -1550.846090 hartree
zpe.sumelectthermalent: -1550.845146 hartree
zpe.sumelectthermalfe: -1550.907193 hartree
dipole: -0.1522 -2.2566 0.4009
dipole: 2.2969
quadrupole: -115.0397 -116.4716 -110.9420
quadrupole: 7.1795 -1.4053 4.7951
quadrupole: -0.8886 -2.3205 3.2091 7.1795 -1.4053 4.7951
hfenergy: -1551.068557 hartree
pointgroup: C01 [X(C13H11Cl2N1O1)]
dipole: 0.0166193 -0.8690778 0.2471406 debye
polarizability: 263.1761703|-19.2234917|142.4079419|-8.0810555|-33.3290891|122.990284 unknown
InChI: InChI=1S/C13H11Cl2NO/c14-11-6-9(7-12(15)13(11)17)8-16-10-4-2-1-3-5-10/h1-7,16-17H,8H2
charge 0 multiplicity 1
28 atoms
Cl 4.552452 -2.378736 0.661276
Cl 3.234617 2.718609 -1.101443
O  5.045032 0.416732 -0.49043
N  -1.381024 -0.197189 -0.312708
C  -0.497992 -0.585263 0.789528
C  0.96493 -0.349785 0.434838
C  -2.765327 -0.016196 -0.177903
C  1.378266 0.893765 -0.109205
C  1.933817 -1.352993 0.670107
C  3.279348 -1.092041 0.367756
C  2.729899 1.12528 -0.40863
C  3.72273 0.138705 -0.17745
C  -3.427231 -0.118653 1.080859
C  -3.543596 0.297326 -1.333014
C  -4.818409 0.107124 1.171882
C  -4.930473 0.511014 -1.227039
C  -5.583661 0.423282 0.027284
H  -0.639726 -1.648882 1.087455
H  -0.760736 0.026278 1.677105
H  -1.01142 -0.314133 -1.256763
H  0.638367 1.678199 -0.294355
H  1.644304 -2.324345 1.082017
H  -2.869392 -0.3845 1.984353
H  -3.049183 0.379567 -2.309767
H  -5.307164 0.025733 2.149939
H  -5.505701 0.751549 -2.128708
H  -6.662308 0.592603 0.106557
H  5.617982 -0.367947 -0.276241
