program: Gaussian 09
title: 000241456
version: EM64L-G09RevD.01
frameworkgroup: C1[X(C8H11NO)]
method: RPBEPBE
basis: SDD
operation: Freq
keyword: #p
keyword: freq=noraman
keyword: PBEPBE/SDD
title: #p freq=noraman PBEPBE/SDD
converged: YES YES NO NO
title: Mulliken charges:
elementType: O N C C C C C C C C H H H H H H H H H H H
charge: -0.449483 -0.627277 -0.172585 0.322186 -0.710884 0.116483 -0.365743 -0.396905 -0.251015 -0.213860 0.228390 0.231438 0.202285 0.243364 0.290215 0.267739 0.272015 0.212764 0.223480 0.223932 0.353461
chargesum: 0.00000
title: Mulliken charges with hydrogens summed into heavy atoms:
elementType: O N C C C C C C C C
charge: -0.096023 -0.087523 0.055805 0.322186 -0.033797 0.116483 -0.075528 -0.184142 -0.027535 0.010073
polarizability: 1.19573659e+02 -1.69115362e+00 1.04995512e+02 1.77345353e+00 -2.74511688e+00 5.56215971e+01
1716.lowfreq: -13.5891 -5.5414 -0.0008 -0.0004 -0.0003 7.1149 57.7911 117.7117 193.9014
frequency: 57.7686 117.6945 193.8992 209.8913 232.7872 268.5398 307.9107 344.2900 362.7101 410.0936 476.4656 504.7871 518.3919 559.2620 581.6809 651.1743 730.1055 743.6890 756.6549 809.1269 848.4991 907.8022 944.4584 982.0549 991.6695 1026.5190 1046.7754 1062.1117 1133.7786 1146.4618 1165.5636 1178.3263 1216.1212 1247.6130 1288.5292 1329.5671 1357.4290 1375.4117 1398.4966 1437.9655 1469.1193 1472.7827 1489.0548 1601.3882 1614.2836 1638.5110 2913.3181 2978.1577 3073.6303 3106.5196 3108.7241 3132.1124 3148.3371 3163.8819 3451.9562 3580.8955 3581.7604
redmass: 3.1384 3.3715 3.1858 3.1447 1.1907 1.2404 2.7003 3.1726 1.1837 2.7800 3.3026 4.4302 3.8210 3.9667 2.6315 1.7321 3.2852 2.6151 1.5205 5.6802 1.3817 2.4243 1.3270 1.4899 1.3019 1.9792 1.6009 2.6748 2.1253 1.3090 1.1311 1.7501 1.7224 1.9849 1.4815 1.3910 1.6613 1.2298 5.0202 2.3190 1.1080 1.0555 2.3992 6.3843 6.2435 1.1191 1.0826 1.0372 1.0972 1.1003 1.0882 1.0875 1.0930 1.0999 1.0450 1.0667 1.0966
irintensity: 0.2782 5.3744 3.5305 3.3188 26.9404 14.1624 10.8625 18.0524 120.8925 0.8987 14.8684 14.6352 16.9615 3.1338 54.4928 108.4690 13.7075 3.1605 85.3618 26.2819 0.4147 4.8370 2.9556 1.5897 2.7355 18.5751 0.6431 70.6186 81.6317 33.0433 7.2177 13.3976 2.9365 50.8105 43.5209 7.6683 17.4691 21.2545 5.8142 41.5995 8.7212 5.7244 24.7283 23.5140 4.9356 53.7735 37.6120 45.6009 43.0876 16.6948 16.0900 10.5726 9.9738 26.8012 0.7046 22.0544 1.0122
temp: 298.150 k
press: 1.00000 atm
elementType: 8 7 6 6 6 6 6 6 6 6 1 1 1 1 1 1 1 1 1 1 1
symmnumber: 1
zpe: 457251.7 jmol-1
zpe.correction: 0.174158 hartree
zpe.thermalcorrener: 0.184072 hartree
zpe.thermalcorrenthalpy: 0.185016 hartree
zpe.thermalcorrgfe: 0.139471 hartree
zpe.sumelectzpe: -440.662403 hartree
zpe.sumelectthermal: -440.652489 hartree
zpe.sumelectthermalent: -440.651545 hartree
zpe.sumelectthermalfe: -440.697090 hartree
dipole: 0.3926 1.2576 -0.8044
dipole: 1.5436
quadrupole: -50.5013 -54.4564 -61.7691
quadrupole: 4.2589 2.1620 0.5211
quadrupole: 5.0743 1.1192 -6.1935 4.2589 2.1620 0.5211
hfenergy: -440.8365607 hartree
pointgroup: C01 [X(C8H11N1O1)]
dipole: -0.1597028 -0.5741191 -0.1169832 debye
dipolederiv: -0.2097198 0.3741858 -0.0994389 0.3162109 -1.1703928 0.1586041 -0.1117071 0.1685959 -0.4326426 -0.4747355 -0.0193564 0.1540216 -0.0673633 -0.6728715 0.0465818 0.1685689 0.0451477 -0.4152377 0.4140315 0.1315681 -0.1832221 0.0977729 0.3758577 -0.0340256 -0.3190281 -0.105107 0.3758008 0.1943896 -0.1243771 0.0841243 0.1178927 -0.2751803 0.0456157 0.0296702 0.064096 -0.1306036 -0.0164804 -0.0161383 -0.0432833 -0.0442719 0.0501661 0.0278535 0.0742193 0.0173671 -0.0978732 0.0989303 -0.2952652 0.0562782 -0.2997985 1.0512404 -0.2319122 0.097009 -0.2448836 0.0984414 -0.0089181 0.0152516 -0.0250592 -0.0276706 0.0625087 -0.0425533 -0.0233661 -0.0447786 -0.1267176 -0.0918745 0.2668896 -0.0699924 0.0033293 -0.1518531 -0.0141 -0.0182458 -0.0348239 -0.1915952 -0.1567146 -0.0497772 0.0010904 -0.0957296 0.0155381 -0.046297 0.0264513 -0.0489572 -0.1830656 0.0709474 -0.0368256 -0.0154205 0.0875026 0.075843 -0.0569382 -0.0410455 -0.0603748 -0.1359111 -0.0160491 -0.0051728 0.0289677 0.0081013 -0.1841556 -0.0319691 0.0175334 -0.0435535 -0.0178866 0.0892562 0.0461874 -0.002351 0.0001427 -0.0987246 -0.1144056 -0.0086424 -0.0420555 0.0530127 -0.2609811 0.0629299 -0.0352917 0.0569181 0.0864661 -0.012529 -0.0236086 -0.0072912 0.0616237 0.0774791 -0.0760097 0.0795308 -0.0443554 0.0127387 0.1034389 0.0747522 0.0618692 0.006063 0.1165023 -0.0772256 0.0221318 -0.0774691 0.0282207 0.0341164 0.0079958 0.035674 0.1358448 0.2225028 -0.0585459 -0.0360749 -0.079071 0.2501593 -0.043088 -0.0460745 0.0100847 -0.0117512 -0.0392896 -0.0194837 -0.0048865 0.100541 0.2930939 0.0493418 0.007496 0.0610693 0.1958782 0.0123502 -0.0735458 0.0314798 -0.1061155 -0.0771268 0.0707022 0.0407787 0.0730722 0.149062 0.0390946 0.0730218 -0.0081508 0.0902828 -0.091974 0.0589152 -0.0064573 0.0615813 0.151481 -0.1368408 0.0406712 0.0147961 0.0316089 0.0867427 0.0166165 0.0135765 0.0151108 0.1549945 0.0761195 -0.1589824 0.0507508 -0.0684583 0.3337032 0.016032 0.0401242 0.0181572 0.361082 unknown
polarizability: 119.5229198|-2.4441605|100.5125278|-1.473711|-14.4794764|60.1553206 unknown
InChI: InChI=1S/C8H11NO/c1-6(9)7-4-2-3-5-8(7)10/h2-6,10H,9H2,1H3
charge 0 multiplicity 1
21 atoms
O  -0.037136 -2.218941 0.499169
N  2.489336 0.803076 -1.053518
C  1.811062 -0.182955 -0.181854
C  0.304405 0.08464 -0.140268
C  2.413327 -0.090662 1.243411
C  -0.599681 -0.952654 0.211253
C  -0.235069 1.362369 -0.415855
C  -1.994128 -0.727177 0.276743
C  -1.626182 1.607527 -0.351364
C  -2.50773 0.558403 -0.006571
H  1.951217 -1.232942 -0.526952
H  2.289789 0.932222 1.640348
H  3.492806 -0.337093 1.228804
H  1.908674 -0.802469 1.91719
H  0.473268 2.153101 -0.684467
H  2.228371 0.73553 -2.042915
H  3.505048 0.830502 -0.923445
H  -2.673883 -1.546381 0.547397
H  -2.019142 2.606441 -0.569276
H  -3.588077 0.733994 0.0429
H  -0.749576 -2.875334 0.699171
