program: Gaussian 09
title: 000241448
version: EM64L-G09RevD.01
frameworkgroup: C1[X(C5H10N4O2)]
method: RPBEPBE
basis: SDD
operation: Freq
keyword: #p
keyword: freq=noraman
keyword: PBEPBE/SDD
title: #p freq=noraman PBEPBE/SDD
converged: YES YES NO NO
title: Mulliken charges:
elementType: O O N N N N C C C C C H H H H H H H H H H
charge: -0.274657 -0.303117 -0.363352 -0.376279 -0.509019 -0.498873 -0.636877 0.367001 0.191477 0.157848 -0.671059 0.248078 0.245221 0.248039 0.229114 0.388366 0.338299 0.296905 0.302262 0.311181 0.309442
chargesum: 0.00000
title: Mulliken charges with hydrogens summed into heavy atoms:
elementType: O O N N N N C C C C C
charge: -0.274657 -0.303117 0.025013 -0.037979 0.090149 0.121750 -0.143578 0.367001 0.191477 0.157848 -0.193906
polarizability: 1.14763324e+02 1.53400758e+00 1.00111051e+02 -1.92687800e+00 -8.32125631e+00 6.36868880e+01
1716.lowfreq: -15.8066 -6.9224 -0.0007 -0.0005 0.0010 10.1370 44.0789 66.2765 70.9469
frequency: 43.9642 65.9497 70.9401 88.2063 124.1845 141.2858 156.3321 201.1090 222.3938 259.9394 292.2919 336.4164 361.8017 402.3611 544.8669 564.9354 599.9596 615.6690 657.6567 759.0630 767.7819 780.2724 782.7452 828.9385 885.0092 923.8986 933.8224 963.9474 970.9310 1085.5815 1126.8499 1179.6185 1241.1315 1261.7855 1276.6618 1283.5059 1289.5553 1311.9573 1431.4449 1451.5424 1455.1260 1498.7177 1564.4940 1625.1005 1638.1734 1675.6276 1677.7794 3021.2602 3099.5610 3103.9689 3203.7192 3331.1072 3383.0016 3395.4197 3497.3231 3513.8107 3557.5774
redmass: 6.6555 1.5442 4.8786 3.5868 1.6374 3.1087 1.7454 3.6209 3.3367 5.1028 4.4338 3.9576 3.9512 2.3911 4.0080 4.8291 1.4510 2.1185 1.9457 3.2060 1.7351 2.2077 1.8288 1.1691 5.5604 1.9837 3.5748 1.9942 1.4419 2.3996 2.6180 1.8278 2.5425 2.2411 1.2648 1.1640 1.3265 2.4626 1.1786 1.9441 1.1253 1.5915 5.9661 5.7450 4.7861 1.0802 1.0621 1.0620 1.0627 1.1008 1.1145 1.0844 1.0439 1.0431 1.0981 1.0987 1.0795
irintensity: 4.7903 40.6578 1.4687 4.7971 28.5100 6.5188 10.0884 1.1528 15.7829 11.8544 23.6552 34.6907 7.5499 15.7326 11.1865 8.0554 110.4756 45.0627 3.7135 37.3836 129.9897 47.6654 85.8085 155.1320 17.1586 14.3040 23.7510 15.9743 55.7941 9.8373 12.8454 18.0343 31.2883 48.8032 3.0004 2.0775 0.7816 10.5066 12.3384 188.7888 22.7037 206.0886 179.0536 215.4020 18.6750 9.4083 31.4319 11.5258 1.9948 3.4294 9.0786 321.5693 10.6044 1.6608 1.5440 3.6962 35.8168
temp: 298.150 k
press: 1.00000 atm
elementType: 8 8 7 7 7 7 6 6 6 6 6 1 1 1 1 1 1 1 1 1 1
symmnumber: 1
zpe: 433814.2 jmol-1
zpe.correction: 0.165231 hartree
zpe.thermalcorrener: 0.177912 hartree
zpe.thermalcorrenthalpy: 0.178856 hartree
zpe.thermalcorrgfe: 0.125520 hartree
zpe.sumelectzpe: -565.074918 hartree
zpe.sumelectthermal: -565.062237 hartree
zpe.sumelectthermalent: -565.061293 hartree
zpe.sumelectthermalfe: -565.114630 hartree
dipole: 3.6864 0.8403 0.3739
dipole: 3.7994
quadrupole: -68.1402 -65.4906 -61.9649
quadrupole: 6.1027 -0.2909 -1.8324
quadrupole: -2.9417 -0.2920 3.2337 6.1027 -0.2909 -1.8324
hfenergy: -565.2401493 hartree
pointgroup: C01 [X(C5H10N4O2)]
dipole: -1.3819782 -0.2300687 -0.5211806 debye
dipolederiv: -0.7207507 -0.3250097 -0.0592993 -0.2436452 -0.8799128 0.0997075 -0.2651368 -0.1008738 -0.4387985 -1.0548943 -0.0491939 -0.148366 0.3472264 -0.7419661 0.0355378 -0.1531816 -0.0475936 -0.3925839 -0.3442592 0.043129 0.1087285 0.101871 -0.7968905 0.1321983 0.0546772 0.0527354 -0.3244786 -0.8287397 -0.2202256 -0.0786095 0.0382998 -0.0102377 -0.1090158 -0.06616 -0.1109443 -0.4286858 -0.1150737 -0.059935 -0.0085658 -0.0051918 -0.3780321 0.2083575 -0.1113624 0.1673944 -0.2084974 -0.5345595 -0.0957159 -0.04158 0.0114506 -0.1347469 0.026079 -0.0697297 0.0161581 -0.0480798 -0.4727516 0.040426 -0.193536 -0.0602081 0.0107395 0.0304274 -0.247355 0.0667656 -0.0075633 0.4307845 -0.068782 -0.1008282 -0.0337504 -0.21559 0.0006434 -0.273538 -0.0452697 -0.0986119 0.8058367 0.2523519 0.3064404 0.1478312 1.3280506 -0.2830738 0.641432 -0.1755723 0.4494125 1.450164 0.2063399 0.2966774 -0.3141094 0.8304697 -0.0021545 0.2267653 0.0389781 0.2524736 -0.2825861 0.0513996 -0.1682457 0.1985701 -0.0308149 0.0137281 -0.0705902 0.0214647 -0.2472368 0.0597944 0.0204897 0.0053787 0.0324836 0.0246032 -0.1266086 0.0189651 -0.0666789 0.0061008 0.0374595 -0.0065985 -0.0024065 -0.0174796 -0.04283 0.0866649 0.0056597 0.0185956 0.0676834 0.0844255 -0.0747235 0.0366183 -0.0589031 -0.0399287 -0.0020285 0.0305211 0.0150161 0.1469679 -0.0288274 -0.039008 0.1082947 -0.0516949 0.0935995 0.0161142 0.1271243 0.0006324 0.1365766 0.6051435 0.0419982 0.0232233 0.1562754 0.3095641 0.0820195 0.0103102 0.1121548 0.2218894 0.2215527 -0.0054 -0.0062616 -0.011998 0.0598703 0.0422194 0.041409 0.0654787 0.3275999 0.0046211 0.0351696 0.005359 -0.142116 0.3333291 -0.0637959 0.0764721 -0.0182102 0.1081497 0.1339177 0.0563148 -0.0840513 -0.0003736 0.0794311 -0.1742019 -0.0205913 -0.0337414 0.2265837 0.2580126 0.0561196 -0.1469244 -0.0503772 0.1104644 0.0258677 -0.0835074 0.0097125 0.1066334 0.2907301 0.1408539 0.1479543 -0.0441608 0.0908282 -0.0386858 0.1278162 0.0137981 0.1444651 unknown
polarizability: 112.6748364|2.7568922|102.2365052|9.615129|0.2691849|63.6499218 unknown
InChI: InChI=1S/C5H10N4O2/c1-3(5(11)9-7)2-4(10)8-6/h8-9H,1-2,6-7H2
charge 0 multiplicity 1
21 atoms
O  2.723141 1.808834 0.096857
O  -0.175505 -1.773133 -0.413774
N  2.216033 -0.452179 0.374339
N  -2.329792 -0.989404 -0.752755
N  3.160403 -0.662239 1.42215
N  -2.939875 -2.265045 -0.625892
C  0.900584 0.840985 -1.264933
C  -0.488581 0.638906 -0.674597
C  2.035209 0.785466 -0.205986
C  -0.969181 -0.786426 -0.595005
C  -1.232704 1.669627 -0.181926
H  1.098066 0.081594 -2.043091
H  0.973074 1.841532 -1.719756
H  -0.863177 2.699717 -0.226972
H  -2.193027 1.514871 0.32359
H  1.534095 -1.207801 0.188194
H  -2.954927 -0.218708 -0.992055
H  4.108183 -0.768994 1.031302
H  3.138479 0.138768 2.071308
H  -2.709938 -2.680074 0.287996
H  -2.639358 -2.889195 -1.388793
