program: Gaussian 09
title: 000242033
version: EM64L-G09RevD.01
frameworkgroup: C1[X(C13H18O4S)]
method: RPBEPBE
basis: SDD
operation: Freq
keyword: #p
keyword: freq=noraman
keyword: PBEPBE/SDD
title: #p freq=noraman PBEPBE/SDD
converged: NO YES NO NO
title: Mulliken charges:
elementType: S O O O O C C C C C C C C C C C C C H H H H H H H H H H H H H H H H H H
charge: 0.983178 -0.484934 -0.554177 -0.579480 -0.502363 0.329488 -0.475878 -0.489651 -0.567061 -0.403560 -0.394730 -0.391279 0.507968 -0.369868 -0.399664 -0.226292 -0.230939 -0.225921 0.243888 0.210351 0.199716 0.252874 0.305498 0.233262 0.198489 0.201145 0.219697 0.187554 0.209934 0.363416 0.236196 0.325052 0.375616 0.237187 0.237193 0.238094
chargesum: 0.00000
title: Mulliken charges with hydrogens summed into heavy atoms:
elementType: S O O O O C C C C C C C C C C C C C
charge: 0.983178 -0.121518 -0.178560 -0.579480 -0.502363 0.329488 -0.021639 -0.037061 -0.261563 0.028191 0.026112 0.006209 0.507968 -0.133672 -0.074612 0.010895 0.006254 0.012173
polarizability: 2.28168021e+02 -2.39715101e+01 1.94328072e+02 -2.34564589e+00 -1.03148286e+01 1.49719647e+02
1716.lowfreq: -13.4707 -11.1401 -0.0019 0.0012 0.0014 13.1260 29.9041 56.2280 58.7279
frequency: 29.6818 56.2028 58.6932 78.4675 79.5482 91.6509 111.0641 131.2563 149.8722 177.1199 196.3503 208.4409 230.5530 258.5135 266.9832 289.9423 301.7336 305.3221 363.1503 385.0582 401.0777 405.5938 433.1018 478.8375 484.7033 527.6827 570.1294 588.6766 611.0670 646.0002 684.7997 701.6116 756.8724 770.3307 779.9190 796.0564 813.9295 832.9084 855.4625 862.2269 907.3327 916.3862 923.4109 934.7204 951.1902 961.3487 987.7991 997.2980 1024.9155 1025.7674 1035.8319 1047.6869 1058.4715 1061.0871 1082.5252 1087.8034 1100.1014 1141.0764 1152.8461 1176.5822 1180.8239 1194.6588 1217.1576 1261.0644 1270.2359 1274.0691 1318.1803 1322.5215 1335.7118 1339.7615 1349.3575 1356.8692 1361.2715 1391.5582 1404.8837 1443.9110 1446.2345 1453.0108 1454.9924 1464.6596 1471.0109 1479.6992 1576.3613 1605.5344 2964.1797 2975.2769 2982.3856 2993.1444 2993.8270 3034.1162 3039.7286 3053.3609 3058.6479 3067.5575 3072.6434 3127.6511 3134.6186 3147.2126 3157.5272 3169.5572 3219.7062 3477.8719
redmass: 5.4355 4.0877 4.4644 4.1000 2.1141 3.3255 3.2150 6.4083 6.7447 4.6540 5.2655 2.2218 4.9200 4.3107 4.6033 7.5847 3.8498 2.6514 3.2048 2.0946 3.0418 5.8350 3.8610 2.4230 2.5265 8.6246 4.9620 3.6508 6.3058 2.8262 1.3522 1.4939 5.6314 1.5363 1.9330 8.9196 4.3404 2.3164 1.8449 1.2565 2.9957 4.1758 1.5295 2.4616 1.3988 2.1845 5.1566 1.4170 1.7380 1.6296 1.8526 1.4680 1.9508 1.7371 1.4895 1.5980 1.5546 1.6004 2.6195 1.0739 1.3504 1.1270 1.5914 1.3653 1.4090 1.2075 1.7416 1.2981 1.3596 1.3774 1.4633 1.6042 1.3931 5.0545 1.2894 1.2259 1.8211 1.0959 1.0854 1.0837 1.0979 2.2319 5.5716 5.8311 1.0639 1.0614 1.0626 1.0638 1.0612 1.0964 1.0978 1.1012 1.1006 1.0989 1.0895 1.0874 1.0880 1.0924 1.0965 1.1016 1.0675 1.0662
irintensity: 4.6887 0.4176 0.9743 2.3702 26.5532 1.7362 32.1223 30.8400 0.4722 4.9285 5.4932 3.2650 8.0720 6.4666 25.7332 5.3824 5.4634 5.6600 33.7349 6.1841 5.5157 25.9596 2.9463 6.6060 7.8318 154.3645 46.7282 2.0415 0.9258 8.3103 98.9328 116.1484 7.5556 2.2381 19.3009 65.3171 6.3912 6.8147 3.7310 2.2572 28.6135 57.7680 23.0880 11.2830 6.3721 48.7656 1.6585 1.3423 5.5659 2.0520 2.8589 45.6437 8.4080 4.5006 20.1162 11.9985 0.6172 3.8534 22.8774 1.1262 24.2713 18.7488 20.7508 3.5296 18.5763 13.3162 18.4380 1.0839 3.4093 1.9998 0.7556 12.2633 4.1594 1.5845 55.8621 13.5855 10.7574 8.1528 7.8043 14.4168 3.9649 0.9477 0.6531 26.4041 42.7498 8.6765 26.4669 22.8122 43.8548 65.2399 16.9387 17.8143 30.2181 29.5821 16.9990 2.0106 3.9248 11.7212 8.9213 35.2340 120.2358 51.9993
temp: 298.150 k
press: 1.00000 atm
elementType: 16 8 8 8 8 6 6 6 6 6 6 6 6 6 6 6 6 6 1 1 1 1 1 1 1 1 1 1 1 1 1 1 1 1 1 1
symmnumber: 1
zpe: 753571.5 jmol-1
zpe.correction: 0.287020 hartree
zpe.thermalcorrener: 0.305760 hartree
zpe.thermalcorrenthalpy: 0.306704 hartree
zpe.thermalcorrgfe: 0.239899 hartree
zpe.sumelectzpe: -1203.602875 hartree
zpe.sumelectthermal: -1203.584134 hartree
zpe.sumelectthermalent: -1203.583190 hartree
zpe.sumelectthermalfe: -1203.649996 hartree
dipole: 1.5824 -5.5094 -1.1295
dipole: 5.8424
quadrupole: -100.9059 -130.8503 -113.4523
quadrupole: -5.2788 4.8964 2.6975
quadrupole: 14.1636 -15.7808 1.6172 -5.2788 4.8964 2.6975
hfenergy: -1203.8898948 hartree
pointgroup: C01 [X(C13H18O4S1)]
dipole: 0.7714911 2.081961 0.594667 debye
polarizability: 231.3972597|21.1893192|192.1760126|4.286948|-7.3299024|148.6424668 unknown
InChI: InChI=1S/C13H17O.HO3S/c14-13(9-5-2-6-10-13)11-12-7-3-1-4-8-12;1-4(2)3/h1,3-4,7-8,11,14H,2,5-6,9-10H2;1H
charge 0 multiplicity 1
36 atoms
S  0.211637 -2.33013 -0.196426
O  -1.201861 0.332728 -1.474889
O  2.053847 -2.648492 -0.25764
O  -0.273253 -2.262198 -1.770655
O  -0.401581 -3.476071 0.758064
C  -1.287101 0.215348 -0.011304
C  -1.49411 1.669384 0.524218
C  -2.498763 -0.674435 0.401453
C  0.034066 -0.294685 0.611482
C  -2.843154 2.25805 0.051625
C  -3.842158 -0.068048 -0.063115
C  -4.032285 1.367939 0.472944
C  1.340071 0.346931 0.370003
C  2.349656 0.224024 1.370169
C  1.631465 1.079938 -0.820151
C  3.607013 0.832221 1.201446
C  2.893148 1.68437 -0.984294
C  3.883144 1.564266 0.021244
H  -0.657424 2.298421 0.1735
H  -1.46053 1.652272 1.632448
H  -2.502325 -0.785049 1.505039
H  -2.391715 -1.690547 -0.02277
H  -0.101036 -0.639654 1.650689
H  -2.822416 2.347867 -1.050147
H  -2.950587 3.278185 0.46872
H  -4.669012 -0.722758 0.271436
H  -3.863875 -0.050357 -1.169373
H  -4.108523 1.345517 1.58046
H  -4.980477 1.793976 0.093652
H  -1.014982 -0.586069 -1.848825
H  2.142841 -0.35777 2.27652
H  0.855468 1.166118 -1.586987
H  2.305398 -2.560688 -1.223218
H  4.37288 0.731855 1.977412
H  3.109221 2.248679 -1.897942
H  4.863813 2.033759 -0.115086
