program: Gaussian 09
title: 000242018
version: EM64L-G09RevD.01
frameworkgroup: C1[X(C15H12N4)]
method: RPBEPBE
basis: SDD
operation: Freq
keyword: #pfreq=noraman
keyword: PBEPBE/SDD
title: #p freq=noraman PBEPBE/SDD
converged: NO YES NO NO
title: Mulliken charges:
elementType: N N N N C C C C C C C C C C C C C C C H H H H H H H H H H H H
charge: -0.010819 -0.415313 0.082704 -0.027198 0.416590 -0.088093 -0.311311 0.170559 -0.387450 -0.314039 -0.324874 -0.247369 -0.220982 -0.425529 0.481361 -0.352455 -0.297135 -0.304635 -0.318678 0.244494 0.234129 0.267429 0.223861 0.231082 0.233229 0.206160 0.271922 0.220265 0.284926 0.237635 0.239531
chargesum: 0.00000
title: Mulliken charges with hydrogens summed into heavy atoms:
elementType: N N N N C C C C C C C C C C C C C C C
charge: -0.010819 -0.143391 0.082704 -0.027198 0.416590 -0.088093 -0.066817 0.170559 -0.153320 -0.046610 -0.101013 -0.016287 0.012248 -0.219369 0.481361 -0.132190 -0.012209 -0.066999 -0.079147
polarizability: 4.38947871e+02 1.29052534e+01 2.16104592e+02 -1.81151520e-03 6.06907454e-03 7.21588184e+01
1716.lowfreq: -0.0010 0.0004 0.0010 5.0625 6.9488 12.6100 30.3400 38.6390 41.0738
frequency: 30.0068 38.5105 41.0013 85.8589 144.8756 169.5432 178.5840 224.1841 226.9624 250.2074 320.8813 343.8391 376.6573 405.4840 419.3531 469.0328 476.9358 516.6532 530.3127 543.1600 566.8511 614.6997 623.0727 636.8984 659.3769 686.6686 736.1591 738.3510 765.1543 768.6738 798.2647 818.6832 837.6714 857.0807 867.7504 884.7263 914.1202 914.8244 949.9444 952.7093 963.8061 977.0757 978.1606 983.9497 997.4303 1016.7285 1046.0068 1073.9547 1103.5786 1114.4100 1150.7046 1167.0545 1210.5659 1213.3253 1243.1920 1252.8687 1283.6752 1297.8389 1308.5302 1331.0770 1360.2979 1367.3282 1403.6995 1411.9250 1417.9218 1458.4011 1465.0230 1497.8940 1518.0822 1533.6937 1564.7339 1580.8154 1596.0236 1597.6981 1624.6551 2966.6178 3119.6316 3119.8768 3123.1913 3135.8592 3136.9323 3145.2798 3147.7953 3155.7168 3171.2249 3191.9427 3365.4642
redmass: 4.4119 6.2471 4.4605 6.1665 5.7024 3.9650 4.1877 3.5898 6.8612 4.9582 5.4164 4.8769 2.5986 3.3778 5.0657 6.5008 2.9531 7.0922 2.9479 3.2427 6.7818 7.3897 1.2628 6.6829 7.0555 2.9964 3.4220 5.6733 1.3437 5.7327 3.2101 1.4954 1.4284 4.9333 1.2640 1.6638 5.1484 1.5746 1.3886 7.0388 1.3536 1.4125 4.6115 1.3845 1.3326 2.1327 2.0408 2.0554 2.9335 1.7336 1.2055 1.1084 1.5712 1.5847 2.4339 1.7049 2.2158 2.7843 2.9144 1.8384 2.7877 1.7283 4.3344 2.4330 2.2743 2.8782 1.9930 3.2034 3.0348 7.2998 5.9060 4.2070 4.6072 6.0381 6.6155 1.0859 1.0876 1.0875 1.0871 1.0904 1.0891 1.0978 1.0986 1.0949 1.0991 1.0952 1.0744
irintensity: 0.0472 0.3558 0.7671 1.7737 2.3185 8.5835 3.4295 23.9708 0.3285 0.1653 7.4476 0.1991 0.0347 0.6240 16.0116 1.2021 11.4880 0.1056 29.0625 1.3871 5.2570 15.0223 54.7036 28.3664 0.4723 0.1978 0.8356 5.5370 61.2044 3.4547 0.6327 71.3446 66.5927 0.6405 8.1253 0.1152 2.5846 52.2171 1.0342 13.4148 4.0868 0.9454 3.0073 1.0113 0.1557 8.5018 2.0637 80.3009 201.3419 12.8503 8.9333 4.9182 28.3370 4.9091 12.5673 3.5010 110.8828 16.2674 44.8366 2.9008 5.6444 36.7038 3.5403 18.6748 10.3080 6.3401 91.9924 57.2242 104.7274 272.7121 457.0834 129.0046 131.0368 22.9715 2.3950 63.8968 9.1211 11.7728 7.6375 29.9146 10.9721 32.3064 27.0911 29.4433 23.0078 1.0771 0.0220
temp: 298.150 k
press: 1.00000 atm
elementType: 7 7 7 7 6 6 6 6 6 6 6 6 6 6 6 6 6 6 6 1 1 1 1 1 1 1 1 1 1 1 1
symmnumber: 1
zpe: 623705.3 jmol-1
zpe.correction: 0.237557 hartree
zpe.thermalcorrener: 0.252317 hartree
zpe.thermalcorrenthalpy: 0.253261 hartree
zpe.thermalcorrgfe: 0.193978 hartree
zpe.sumelectzpe: -796.469764 hartree
zpe.sumelectthermal: -796.455003 hartree
zpe.sumelectthermalent: -796.454059 hartree
zpe.sumelectthermalfe: -796.513342 hartree
dipole: 3.9966 -4.8998 -0.0002
dipole: 6.3230
quadrupole: -110.7813 -90.9516 -117.2076
quadrupole: 17.1985 0.0011 0.0009
quadrupole: -4.4678 15.3619 -10.8941 17.1985 0.0011 0.0009
hfenergy: -796.7073205 hartree
pointgroup: C01 [X(C15H12N4)]
dipole: 1.5883649 1.9145681 0.0000819 debye
polarizability: 438.7177428|-14.7572028|216.3347201|0.0018619|0.0060538|72.1588184 unknown
InChI: InChI=1S/C15H12N4/c1-2-4-15-12(3-1)5-6-14(18-15)11-17-19-13-7-9-16-10-8-13/h1-11,19H
charge 0 multiplicity 1
31 atoms
N  1.428193 -0.160811 0.000109
N  -2.56422 1.217826 0.000139
N  -1.289948 0.722579 0.000137
N  -5.950444 -1.369215 -0.000064
C  3.841953 0.463302 0.000105
C  2.766695 -0.513475 0.000083
C  3.47055 1.848035 0.000156
C  1.116672 1.159686 0.000158
C  5.200205 0.014822 0.000075
C  3.097837 -1.908442 0.000033
C  2.123182 2.196381 0.000182
C  5.492281 -1.352304 0.000026
C  4.433615 -2.317754 0.000004
C  -0.290177 1.58266 0.000192
C  -3.668287 0.350318 0.000069
C  -4.983848 0.886074 0.000056
C  -3.509256 -1.061521 0.000014
C  -6.074617 -0.007212 -0.000008
C  -4.67014 -1.859295 -0.000052
H  4.250573 2.618292 0.000175
H  6.008066 0.756985 0.000092
H  2.270107 -2.62409 0.000017
H  1.813882 3.247685 0.000222
H  6.533443 -1.693164 0.000003
H  4.679523 -3.385411 -0.000035
H  -0.462661 2.678827 0.000227
H  -2.739751 2.235191 0.000182
H  -5.1591 1.968729 0.000096
H  -2.508252 -1.497448 0.000021
H  -7.100361 0.379158 -0.00002
H  -4.581814 -2.951708 -0.000097
