program: Gaussian 09
title: 000241432
version: EM64L-G09RevD.01
frameworkgroup: C1[X(C17H14N4O5)]
method: RPBEPBE
basis: SDD
operation: Freq
keyword: #p
keyword: freq=noraman
keyword: PBEPBE/SDD
title: #p freq=noraman PBEPBE/SDD
converged: YES YES NO NO
title: Mulliken charges:
elementType: O O O O O N N N N C C C C C C C C C C C C C C C C C H H H H H H H H H H H H H H
charge: -0.262106 -0.262105 -0.259708 -0.259709 -0.201704 0.052576 0.052575 -0.421624 -0.421625 0.220544 0.220544 0.172967 0.172966 -0.485452 -0.485451 0.509398 0.509396 -0.330935 -0.330935 -0.202134 -0.202133 -0.395187 -0.395188 -0.394630 -0.394630 0.350936 0.304282 0.304284 0.252238 0.252238 0.239841 0.239846 0.239844 0.239843 0.225780 0.225780 0.203950 0.203951 0.255738 0.255738
chargesum: 0.00000
title: Mulliken charges with hydrogens summed into heavy atoms:
elementType: O O O O O N N N N C C C C C C C C C C C C C C C C C
charge: -0.262106 -0.262105 -0.259708 -0.259709 -0.201704 0.052576 0.052575 -0.165886 -0.165886 0.220544 0.220544 0.172967 0.172966 -0.181170 -0.181168 0.509398 0.509396 -0.078697 -0.078697 0.277554 0.277554 -0.169408 -0.169408 -0.190680 -0.190679 0.350936
polarizability: 6.19295556e+02 4.77308203e-06 2.46491862e+02 1.36112667e-02 -1.78006281e-02 9.59366569e+01
1716.lowfreq: -40.4231 -39.9399 -6.3000 -4.2265 -0.0008 0.0007 0.0011 1.4468 8.4395
frequency: -40.4197 -39.9338 -6.2796 17.2165 18.0422 50.2731 55.2744 60.1662 100.6170 110.4664 126.7923 163.0254 187.3023 210.3220 217.0801 219.0008 219.0610 250.4721 266.9760 296.1818 360.9861 364.6257 365.7761 370.3352 429.0075 435.6149 436.5988 466.5894 498.1186 502.2520 557.0493 593.6685 597.7415 602.7266 612.8239 615.8100 636.9349 680.0074 680.7919 689.3808 722.6370 722.8309 735.9032 765.3966 776.6060 792.0629 807.0410 807.2357 813.7987 842.0246 843.8317 904.6766 905.2330 921.7872 922.2074 927.8297 939.8640 940.8005 940.9629 979.1409 980.3096 1007.6888 1023.7192 1061.1082 1061.9921 1065.0120 1065.0146 1120.1441 1120.1459 1122.5170 1126.9022 1145.5073 1158.4194 1195.2200 1198.4504 1254.8516 1256.0113 1262.8853 1263.7671 1338.3101 1338.4225 1365.7708 1365.8815 1394.8189 1395.6582 1455.6330 1455.7703 1472.7098 1474.8101 1486.2757 1486.3451 1509.9603 1520.1144 1575.5207 1580.9884 1607.4239 1607.9296 1624.4042 1624.4108 1693.8449 2961.0713 2961.3789 3015.4653 3015.6223 3094.1176 3094.1282 3135.3859 3135.3948 3183.2122 3183.2312 3186.7752 3186.8004 3342.6673 3353.5365
redmass: 2.3645 2.3438 4.6656 7.7249 8.4453 6.5878 7.4422 7.5833 7.0870 8.3171 3.7584 3.8914 7.3430 6.3841 5.9975 4.0590 7.1559 5.1695 5.4616 8.6344 6.6044 4.4351 4.9975 7.3939 6.1415 2.9821 3.1887 5.6500 6.4553 1.5094 6.4930 6.2398 1.4212 7.8807 4.2943 3.1925 8.0585 9.5812 9.6516 7.7058 4.3685 4.3734 7.2426 7.0318 6.5328 5.6259 1.3544 1.3554 5.6338 10.8228 10.8781 1.3498 1.3505 1.4084 1.4013 4.1524 1.5094 1.5144 3.5442 5.4831 4.4479 4.2792 8.4197 3.9610 4.0825 1.4573 1.4574 1.0367 1.0367 1.8876 1.7834 1.9933 2.5442 1.7927 1.9182 1.8280 1.6071 1.9932 2.2498 1.7338 1.8223 1.2811 1.2840 3.5282 3.5242 4.3480 4.4749 2.4212 2.4375 1.2193 1.2382 2.0459 1.7170 7.0770 6.8022 7.5996 7.4803 7.8573 7.8295 8.5911 1.0866 1.0867 1.0534 1.0534 1.1190 1.1190 1.0897 1.0897 1.0951 1.0951 1.0942 1.0942 1.0750 1.0741
irintensity: 0.0080 32.1928 0.0000 0.0780 1.7591 0.0000 6.8806 13.0385 2.5003 0.0262 0.0000 0.0000 0.1268 2.4961 0.0000 15.3205 9.1653 0.0000 26.7168 19.3633 1.0571 0.0001 3.0140 6.1096 1.1149 0.0000 8.1062 1.1617 4.6611 0.0001 28.6458 0.0247 104.6643 11.9588 0.0000 104.9969 1.7656 0.0000 0.6969 1.6807 0.0000 7.1551 6.2907 18.7068 13.8420 5.3093 0.0000 74.5440 41.7126 34.1810 0.0008 0.0000 0.8636 0.0001 73.7817 0.0025 0.0001 60.3977 3.6876 142.8948 261.3137 3.8441 63.4647 16.6183 6.9630 0.9278 7.8068 0.0022 0.0138 0.8432 1089.2517 1212.0769 4.6635 0.1370 83.8416 252.0630 15.4386 165.9991 163.9462 50.1764 9.6305 0.0045 2.8265 19.4135 36.6535 132.2175 120.9910 462.5518 45.9533 29.3163 18.6427 579.8542 9.2964 1.7934 0.0606 3.0226 10.1695 0.4971 28.0823 172.2343 32.3108 102.7752 177.6356 125.4656 7.1537 55.5200 3.1231 19.1098 8.1187 3.5252 13.9216 0.1844 56.9588 6.6724
temp: 298.150 k
press: 1.00000 atm
elementType: 8 8 8 8 8 7 7 7 7 6 6 6 6 6 6 6 6 6 6 6 6 6 6 6 6 6 1 1 1 1 1 1 1 1 1 1 1 1 1 1
symmnumber: 1
zpe: 758375.2 jmol-1
zpe.correction: 0.288850 hartree
zpe.thermalcorrener: 0.309110 hartree
zpe.thermalcorrenthalpy: 0.310055 hartree
zpe.thermalcorrgfe: 0.237257 hartree
zpe.sumelectzpe: -1249.377534 hartree
zpe.sumelectthermal: -1249.357273 hartree
zpe.sumelectthermalent: -1249.356329 hartree
zpe.sumelectthermalfe: -1249.429127 hartree
dipole: 0.0001 -5.9099 0.0031
dipole: 5.9099
quadrupole: -110.7673 -124.1425 -153.2360
quadrupole: 0.0000 0.0034 0.0019
quadrupole: 18.6146 5.2394 -23.8541 0.0000 0.0034 0.0019
hfenergy: -1249.6663836 hartree
pointgroup: C01 [X(C17H14N4O5)]
dipole: -0.0003754 -2.3251289 -0.004025 debye
polarizability: 619.2955432|-0.0651292|246.491183|0.0275166|0.3228704|95.9373483 unknown
InChI: InChI=1S/C17H14N4O5/c22-17(20-18-7-11-1-3-13-15(5-11)25-9-23-13)21-19-8-12-2-4-14-16(6-12)26-10-24-14/h1-8,20-21H,9-10H2
charge 0 multiplicity 1
40 atoms
O  6.82753 2.314696 0.004892
O  -6.825641 2.317079 0.00731
O  8.676893 0.78029 0.003443
O  -8.675559 0.783348 0.003283
O  0.000653 0.843259 0.001698
N  2.406424 -0.626224 -0.000674
N  -2.405609 -0.625409 -0.001231
N  1.162487 -1.219097 -0.001754
N  -1.161875 -1.218703 -0.002867
C  6.358178 0.977515 0.002904
C  -6.356773 0.979733 0.003537
C  7.451568 0.076818 0.002046
C  -7.45049 0.079435 0.001161
C  5.037612 0.546907 0.00185
C  -5.036365 0.548644 0.002177
C  4.819206 -0.87061 -0.000175
C  -4.818472 -0.868948 -0.001808
C  7.264546 -1.306956 0.000053
C  -7.263971 -1.304402 -0.002747
C  8.309321 2.225088 0.005451
C  -8.307463 2.22801 0.007238
C  5.922488 -1.76901 -0.001046
C  -5.922081 -1.766945 -0.004204
C  3.460084 -1.418194 -0.001318
C  -3.459544 -1.417011 -0.00343
C  0.000444 -0.402167 -0.00078
H  4.187644 1.23321 0.002522
H  -4.186147 1.234635 0.0040
H  8.111947 -1.996472 -0.000613
H  -8.111623 -1.993607 -0.004582
H  8.699707 2.690471 0.926638
H  8.700563 2.693248 -0.913959
H  -8.698215 2.697467 -0.911722
H  -8.698004 2.692376 0.928871
H  5.734396 -2.848965 -0.002597
H  -5.73438 -2.846965 -0.007249
H  3.372278 -2.52498 -0.0027
H  -3.372124 -2.523825 -0.006535
H  1.075813 -2.248052 -0.002856
H  -1.07555 -2.247685 -0.005729
