program: Gaussian 09
title: 000241430
version: EM64L-G09RevD.01
frameworkgroup: C1[X(C17H18N4O)]
method: RPBEPBE
basis: SDD
operation: Freq
keyword: #p
keyword: freq=noraman
keyword: PBEPBE/SDD
title: #p freq=noraman PBEPBE/SDD
converged: YES YES NO NO
title: Mulliken charges:
elementType: O N N N N C C C C C C C C C C C C C C C C C H H H H H H H H H H H H H H H H H H
charge: -0.201166 0.055447 0.055468 -0.423722 -0.423787 0.444965 0.445013 0.454842 0.454759 -0.419292 -0.419351 -0.346790 -0.346775 -0.383608 -0.383596 -0.369566 -0.369529 -0.805558 -0.805588 -0.387980 -0.387950 0.344928 0.230187 0.230217 0.231723 0.231712 0.218722 0.218712 0.279622 0.279679 0.233323 0.223295 0.232661 0.232764 0.233212 0.223295 0.200212 0.200278 0.259615 0.259608
chargesum: 0.00000
title: Mulliken charges with hydrogens summed into heavy atoms:
elementType: O N N N N C C C C C C C C C C C C C C C C C
charge: -0.201166 0.055447 0.055468 -0.164107 -0.164180 0.444965 0.445013 0.454842 0.454759 -0.189105 -0.189134 -0.115067 -0.115063 -0.164886 -0.164884 -0.089944 -0.089850 -0.116279 -0.116317 -0.187768 -0.187672 0.344928
polarizability: 5.81447834e+02 6.35438348e-02 2.10120794e+02 1.09406690e+00 -2.12831446e-01 9.68054574e+01
1716.lowfreq: -11.5791 -5.0247 -0.9473 -0.0008 0.0011 0.0018 9.7909 16.3383 21.0400
frequency: 9.1068 15.7120 21.0061 21.4888 26.3131 50.4573 58.7160 65.2283 97.5395 116.8822 143.1612 172.4183 190.8246 204.2000 221.3723 231.4474 245.7917 303.3670 327.9276 335.6081 363.6323 364.6674 410.6231 410.6926 422.9709 434.3952 481.1938 504.5361 519.7235 529.2141 566.5709 591.2117 624.2039 635.3507 641.6134 683.6721 726.6877 726.9271 733.3472 767.5132 787.5918 824.3016 824.5565 846.5225 858.4844 858.5862 879.6322 926.1421 927.2481 961.1608 961.4047 983.7163 983.9072 995.9737 996.0533 1006.0915 1009.7764 1010.7819 1027.3189 1046.7058 1046.7407 1121.4199 1124.5323 1140.1000 1148.0677 1188.9269 1189.2136 1223.1656 1223.2519 1239.9350 1242.2243 1309.8547 1310.0336 1335.1994 1336.1312 1376.2329 1377.5093 1396.9374 1396.9963 1414.8059 1414.8643 1468.3118 1468.3816 1473.1498 1473.3288 1493.5357 1496.3445 1513.9809 1517.9234 1563.8083 1565.4820 1592.0980 1595.7450 1622.9515 1623.1737 1692.4457 2952.6713 2953.0432 2975.8456 2975.9113 3053.1737 3053.2407 3085.2168 3085.2586 3110.3313 3110.3463 3123.2460 3123.2853 3137.7203 3137.8197 3161.1539 3161.1950 3346.0482 3355.7090
redmass: 1.9447 2.9114 3.2423 1.8272 1.1603 4.5482 5.4887 5.5844 4.4363 5.0395 4.7742 2.8730 5.4034 3.4597 5.6267 3.8627 4.0170 7.0002 2.9525 3.0180 3.3795 3.8391 2.8716 2.8768 4.9749 5.6815 5.9068 1.5176 2.4519 2.2766 5.1915 1.3259 6.1916 6.9810 6.6546 7.5758 2.9571 2.9632 6.0195 4.4886 5.2269 1.3803 1.3816 5.1988 1.2793 1.2794 4.3664 1.4643 1.4599 1.4221 1.4243 1.4554 1.4629 1.3530 1.3532 5.0496 3.0375 2.8468 6.4360 1.5640 1.5640 1.4494 1.3217 2.8374 4.1567 1.1177 1.1130 2.7579 2.7586 1.9685 1.9108 1.4217 1.4154 1.6631 1.7623 3.1847 3.1408 1.2528 1.2558 3.5953 3.5726 1.0459 1.0459 1.1109 1.1102 1.8116 1.7264 2.7083 2.3536 6.4926 6.3204 5.9463 5.8589 6.2929 6.3025 8.8097 1.0864 1.0865 1.0373 1.0373 1.0974 1.0974 1.0986 1.0987 1.0874 1.0874 1.0894 1.0894 1.0961 1.0961 1.0956 1.0956 1.0750 1.0742
irintensity: 0.0224 0.3862 0.6471 2.4503 1.5310 0.0064 5.8839 8.9656 8.4545 0.0216 0.1223 2.0890 0.6019 12.8515 13.4768 0.0418 28.9468 9.2896 0.4857 0.0687 0.4658 7.4106 0.1403 0.0749 0.6747 0.2072 0.3567 0.9711 28.1251 5.0995 14.3544 190.9825 1.8081 0.0698 0.0014 29.7588 0.1987 7.8028 11.4223 0.9842 2.1390 2.4387 62.5580 1.5864 1.0239 15.3374 9.9353 1.6339 57.0256 0.7328 24.6639 12.7084 7.8624 0.7660 4.5654 0.7648 25.1982 0.2706 20.2400 9.0968 17.0584 32.3288 1.3868 1989.3095 5.4756 6.8203 0.0451 0.5956 0.5852 73.0418 2.3669 3.1071 11.0207 11.8821 2.8762 1.0316 0.6741 4.9410 10.8343 7.5752 0.5081 12.7513 13.5220 22.8094 2.6301 786.0384 1.2200 116.0400 6.7050 0.0525 1.6520 0.4120 1.8822 58.4390 3.2157 181.1773 46.7555 94.3841 75.3937 16.4532 19.3282 21.4473 21.2938 22.6252 22.3255 10.8475 9.6710 32.7048 39.4025 32.0181 3.0117 3.9467 53.3084 4.4918
temp: 298.150 k
press: 1.00000 atm
elementType: 8 7 7 7 7 6 6 6 6 6 6 6 6 6 6 6 6 6 6 6 6 6 1 1 1 1 1 1 1 1 1 1 1 1 1 1 1 1 1 1
symmnumber: 1
zpe: 827404.9 jmol-1
zpe.correction: 0.315142 hartree
zpe.thermalcorrener: 0.336841 hartree
zpe.thermalcorrenthalpy: 0.337785 hartree
zpe.thermalcorrgfe: 0.258314 hartree
zpe.sumelectzpe: -951.222434 hartree
zpe.sumelectthermal: -951.200735 hartree
zpe.sumelectthermalent: -951.199790 hartree
zpe.sumelectthermalfe: -951.279262 hartree
dipole: -0.0040 -5.7998 0.0311
dipole: 5.7998
quadrupole: -84.4100 -113.4896 -135.9942
quadrupole: 0.0193 0.9256 0.0084
quadrupole: 26.8879 -2.1917 -24.6963 0.0193 0.9256 0.0084
hfenergy: -951.5375759 hartree
pointgroup: C01 [X(C17H18N4O1)]
dipole: 0.00118 -2.2797539 -0.097386 debye
polarizability: 581.4491661|-0.1512107|209.9470543|0.7274807|4.43916|96.9778652 unknown
InChI: InChI=1S/C17H18N4O/c1-13-3-7-15(8-4-13)11-18-20-17(22)21-19-12-16-9-5-14(2)6-10-16/h3-12,20-21H,1-2H3
charge 0 multiplicity 1
40 atoms
O  -0.000851 1.253651 0.065485
N  2.404705 -0.228763 0.015594
N  -2.405114 -0.229172 -0.007184
N  1.156975 -0.81227 0.078782
N  -1.156938 -0.805723 -0.111927
C  7.503571 0.512627 -0.045162
C  -7.503401 0.510707 0.078402
C  4.817308 -0.479429 0.075345
C  -4.817254 -0.472629 -0.099535
C  7.246051 -0.868505 0.141734
C  -7.245786 -0.851493 -0.216006
C  6.388517 1.390223 -0.1700
C  -6.388597 1.373753 0.282096
C  5.92441 -1.360229 0.20167
C  -5.924114 -1.338887 -0.304289
C  5.069541 0.911031 -0.111774
C  -5.069614 0.898766 0.196342
C  8.921806 1.049635 -0.110553
C  -8.921588 1.043232 0.174709
C  3.453862 -1.016129 0.139802
C  -3.453672 -1.003781 -0.198414
C  -0.000326 0.009021 0.016057
H  8.087912 -1.564046 0.241379
H  -8.087484 -1.535415 -0.377884
H  6.566662 2.463168 -0.314209
H  -6.567069 2.432046 0.509925
H  5.749847 -2.43425 0.347355
H  -5.749245 -2.39804 -0.534168
H  4.215416 1.58921 -0.207053
H  -4.215725 1.565992 0.351896
H  9.108841 1.78756 0.692496
H  9.666773 0.242226 -0.006586
H  9.111908 1.564084 -1.071519
H  -9.121813 1.472893 1.174523
H  -9.098616 1.84838 -0.56336
H  -9.666514 0.249583 -0.006705
H  3.357753 -2.111814 0.296552
H  -3.357038 -2.08346 -0.441773
H  1.060891 -1.828847 0.232322
H  -1.059893 -1.806607 -0.346561
