program: Gaussian 09
title: 000241420
version: EM64L-G09RevD.01
frameworkgroup: C1[X(C8H12N2O3)]
method: RPBEPBE
basis: SDD
operation: Freq
keyword: #p
keyword: freq=noraman
keyword: PBEPBE/SDD
title: #p freq=noraman PBEPBE/SDD
converged: NO YES NO NO
title: Mulliken charges:
elementType: O O O N N C C C C C C C C H H H H H H H H H H H H
charge: -0.197647 -0.360132 -0.314130 -0.359134 -0.148742 -0.220873 -0.125201 -0.423535 -0.397411 -0.418633 -0.379939 0.183526 0.235963 0.268054 0.236467 0.243427 0.197669 0.204404 0.219224 0.235875 0.206781 0.190106 0.212252 0.330417 0.381210
chargesum: 0.00000
title: Mulliken charges with hydrogens summed into heavy atoms:
elementType: O O O N N C C C C C C C C
charge: -0.197647 0.021078 -0.314130 -0.028717 -0.148742 0.047182 0.111266 0.017562 0.026217 0.024023 0.022419 0.183526 0.235963
polarizability: 1.28708898e+02 -6.54933914e+00 1.09580208e+02 -6.69608458e+00 -3.80172632e+00 7.78935152e+01
1716.lowfreq: -13.8868 -0.0005 -0.0005 -0.0004 7.3080 33.1295 78.7825 91.7858 121.1102
frequency: 77.7124 91.7011 120.9315 162.5185 222.0446 264.0519 307.6526 332.4524 349.4793 358.8270 369.3611 447.0749 459.8857 474.0799 498.7637 529.7540 541.8884 570.9739 632.2656 692.5068 737.6067 748.1406 785.9243 834.0774 864.0894 895.8374 910.2775 946.1337 996.2901 1035.7833 1055.0371 1075.1246 1105.3850 1109.1906 1117.5855 1147.6235 1183.5842 1209.5257 1229.4990 1245.7065 1278.1304 1293.7409 1309.9122 1326.9505 1336.7614 1342.2980 1352.4289 1355.0441 1394.6906 1398.6765 1452.0464 1454.7223 1466.7678 1470.6330 1477.9781 1622.9961 1652.4555 2966.2973 2967.9843 2983.0686 2989.2326 2992.3077 3010.2023 3039.7326 3045.8796 3054.7394 3069.5459 3235.7838 3562.8332
redmass: 6.7822 4.7272 7.6269 2.7841 5.7916 2.8314 4.1799 2.8174 4.8239 3.4142 4.8320 3.1672 1.2872 2.6528 4.4316 1.3920 2.2564 4.9584 5.8228 7.1614 3.5674 2.9089 2.4935 1.9276 2.4902 2.8395 1.6000 2.7774 2.4862 2.7569 1.5717 1.7722 1.3101 2.2178 2.5329 2.7072 3.3684 1.5397 1.4153 1.3599 1.3171 1.8105 1.3393 1.9116 1.4118 1.4161 1.4701 1.5004 2.4274 1.5891 1.4838 1.0903 1.0909 1.0836 1.0917 9.6636 6.3715 1.0794 1.0651 1.0611 1.0690 1.0613 1.0862 1.0957 1.1021 1.1014 1.0985 1.0643 1.0775
irintensity: 0.1256 1.8173 0.8490 0.9988 2.0893 1.9547 4.6457 1.0983 28.4836 2.7620 9.5188 0.8648 139.9131 16.4772 13.1971 48.5074 22.7681 2.5040 8.0348 66.0668 7.0933 1.6879 1.3314 31.0490 3.3049 37.8334 1.9526 22.8376 15.6762 10.0230 1.7344 2.5664 4.4693 29.8312 24.1897 2.9983 215.9675 12.0308 5.8255 1.9097 1.6282 5.5817 5.4635 10.1352 3.6389 3.2523 2.8402 3.0220 160.0975 50.5877 169.4131 20.5196 9.5170 13.6439 11.5891 423.2787 154.2141 15.5117 36.3066 25.5726 24.5194 22.9599 26.6228 45.3354 35.8419 63.7712 18.2825 73.9363 52.9059
temp: 298.150 k
press: 1.00000 atm
elementType: 8 8 8 7 7 6 6 6 6 6 6 6 6 1 1 1 1 1 1 1 1 1 1 1 1
symmnumber: 1
zpe: 530186.1 jmol-1
zpe.correction: 0.201937 hartree
zpe.thermalcorrener: 0.213251 hartree
zpe.thermalcorrenthalpy: 0.214195 hartree
zpe.thermalcorrgfe: 0.165253 hartree
zpe.sumelectzpe: -646.211727 hartree
zpe.sumelectthermal: -646.200413 hartree
zpe.sumelectthermalent: -646.199469 hartree
zpe.sumelectthermalfe: -646.248411 hartree
dipole: -3.8672 -4.6588 1.7103
dipole: 6.2917
quadrupole: -80.8573 -83.5972 -74.2058
quadrupole: 2.0400 0.1360 0.4450
quadrupole: -1.3038 -4.0438 5.3476 2.0400 0.1360 0.4450
hfenergy: -646.4136638 hartree
pointgroup: C01 [X(C8H12N2O3)]
dipole: -1.4066711 1.8800358 -0.7835702 debye
dipolederiv: -0.5703968 -0.138889 -0.035308 -0.3768064 -1.0111912 0.0143637 0.0267545 0.1680293 -0.3320824 -0.5472247 0.0839959 -0.119716 0.1817014 -0.1970771 -0.010606 -0.1464099 -0.0026249 -0.3613 -1.3250692 -0.1863614 -0.1411915 -0.209848 -0.6464198 0.0051538 -0.2061087 -0.0087018 -0.4119057 -0.8753765 0.2936604 -0.0581699 0.2875646 -0.6186546 0.0787166 -0.1777355 0.2376068 -0.5865289 -0.4896865 -0.8536987 0.1118726 -0.6870416 -1.0033175 -0.0134731 0.0236853 -0.0849694 -0.0846382 -0.0777116 0.0473994 -0.0330321 -0.0108696 -0.0547953 0.0712632 -0.0793278 0.0897339 0.0199582 0.5488935 -0.0914875 -0.0681776 0.090043 0.1685246 0.0160011 -0.0583921 -0.036779 0.3326414 0.155145 -0.0065516 0.0542323 0.0028073 0.0288847 -0.026038 0.0204054 -0.0411378 0.1082759 -0.0733175 0.0038759 0.0166423 -0.0582812 0.1068841 -0.0563759 0.0510245 0.0103077 0.0051466 0.0611497 -0.0124429 0.0239291 -0.0121793 0.063257 -0.0154607 0.0002633 -0.0080463 0.0662968 0.1063412 -0.042653 0.0154237 -0.0217752 0.0611629 -0.0403518 0.0884398 -0.0728201 0.1198931 1.1281644 0.6044178 0.1851779 0.545059 1.1610569 -0.0420472 0.2828363 -0.1015146 0.3304585 1.6603335 0.1592453 0.2436269 0.2304815 1.5424942 -0.183895 0.3114237 -0.2893699 0.3837875 -0.015256 0.0250925 0.0757819 0.0506277 0.0320037 0.0011658 0.065012 -0.0349763 -0.0865676 -0.0114396 0.0608439 -0.0597076 0.0678631 -0.0165987 0.0807379 -0.0451933 0.0790292 -0.0535882 0.0776658 0.0089964 0.0193951 -0.0483285 -0.0895127 -0.0881939 0.0403628 -0.0381698 0.0613704 -0.0457995 0.0329682 -0.06997 0.0780177 0.0437208 0.1252142 -0.0602608 0.0624522 -0.0872332 0.0448869 -0.0528944 0.0044397 -0.0392184 -0.1784585 -0.0701329 0.0084629 -0.0344081 0.0506121 -0.0169561 0.0349814 -0.0682375 0.0582685 0.0296315 0.0956338 -0.0599151 0.0541934 -0.029156 0.0716815 0.0745201 -0.0844377 0.0366279 -0.0055273 0.0524718 -0.0608073 0.0493931 -0.0597705 -0.200751 -0.0887351 0.0160984 -0.0702672 0.0362717 -0.0182834 0.0032961 -0.0225984 0.0704649 -0.010381 0.0387832 -0.0667306 0.0513017 -0.0364718 0.0750242 -0.1362253 0.1250818 -0.0475918 -0.0274467 0.0331425 0.0922032 0.01637 0.044504 -0.0571184 0.1343372 -0.0815776 -0.1183013 0.1108484 0.0098 -0.050027 -0.0217622 0.1989045 0.0160401 -0.0641953 -0.024734 0.337267 0.3217027 -0.0380093 -0.0041176 -0.1403557 0.3407237 -0.00981 0.0382673 0.0066007 0.3724916 unknown
polarizability: 128.5180077|6.0794477|108.8517759|8.7684101|-4.5183499|78.8128376 unknown
InChI: InChI=1S/C8H12N2O3/c11-7-5-3-1-2-4-6(5)9-8(12)10(7)13/h5-6,9,13H,1-4H2
charge 0 multiplicity 1
25 atoms
O  -0.083217 -2.440956 0.229554
O  2.389901 -1.446387 0.972869
O  3.043269 1.005554 0.271251
N  0.882591 1.51972 -0.523343
N  1.404063 -0.6362 0.300316
C  -0.69349 -0.335071 -0.936896
C  -0.556746 1.157944 -0.537316
C  -2.170071 -0.799384 -0.901288
C  -1.253227 1.473931 0.812516
C  -2.86073 -0.467121 0.441673
C  -2.737457 1.035453 0.783756
C  0.195903 -1.254733 -0.067092
C  1.837735 0.692661 0.011665
H  -0.307167 -0.445516 -1.972397
H  -1.037848 1.761414 -1.33102
H  -2.200392 -1.887622 -1.083776
H  -2.712927 -0.30392 -1.731272
H  -1.167273 2.557341 1.022536
H  -0.725295 0.942258 1.62898
H  -2.4035 -1.073139 1.247733
H  -3.926236 -0.759619 0.389414
H  -3.287473 1.635353 0.028636
H  -3.206056 1.24937 1.762562
H  1.175538 2.484498 -0.684903
H  3.185503 -0.817229 0.974037
