program: Gaussian 09
title: 000241418
version: EM64L-G09RevD.01
frameworkgroup: C1[X(C22H22N2O6)]
method: RPBEPBE
basis: SDD
operation: Freq
keyword: #p
keyword: freq=noraman
keyword: PBEPBE/SDD
title: #p freq=noraman PBEPBE/SDD
converged: YES YES NO NO
title: Mulliken charges:
elementType: O O O O O O N N C C C C C C C C C C C C C C C C C C C C C C H H H H H H H H H H H H H H H H H H H H H H
charge: -0.243827 -0.243929 -0.230123 -0.230933 -0.219652 -0.219722 -0.295001 -0.295737 -0.230215 -0.225784 -0.482066 -0.486818 -0.388458 -0.388884 0.219630 0.218103 0.185415 0.187504 0.240603 0.239069 -0.341432 -0.340765 -0.317306 -0.317694 -0.215657 -0.215571 -0.215761 -0.215654 -0.216994 -0.217055 0.304401 0.302766 0.259133 0.173335 0.261395 0.173963 0.200137 0.230576 0.200289 0.228527 0.329525 0.331564 0.267754 0.267946 0.278320 0.278146 0.236714 0.236750 0.236093 0.236000 0.235687 0.235693
chargesum: 0.00000
title: Mulliken charges with hydrogens summed into heavy atoms:
elementType: O O O O O O N N C C C C C C C C C C C C C C C C C C C C C C
charge: -0.243827 -0.243929 -0.230123 -0.230933 -0.219652 -0.219722 0.034524 0.035827 0.074186 0.076983 -0.049599 -0.051459 0.042255 0.039933 0.219630 0.218103 0.185415 0.187504 0.240603 0.239069 -0.073678 -0.072819 -0.038986 -0.039548 0.021056 0.021179 0.020332 0.020346 0.018694 0.018638
polarizability: 4.21470445e+02 -2.88163627e-01 2.30366124e+02 3.10317120e+01 -8.82781695e-01 1.78875248e+02
1716.lowfreq: -22.0032 -1.8155 0.0004 0.0010 0.0012 4.6271 11.5345 13.6412 23.0041
frequency: 10.8811 11.6082 19.0902 23.1753 27.6050 33.6023 45.4228 46.5631 65.9389 73.2671 91.4665 103.2630 127.7748 129.8944 155.4928 159.3412 181.9040 197.3700 230.5646 274.6148 275.1732 281.3119 295.6942 324.4543 324.9549 376.9879 381.5284 382.9399 389.4622 400.7162 401.0331 405.7620 432.7301 439.7089 449.5842 455.5804 466.5443 496.1266 498.1196 572.7558 596.8555 603.5817 612.8270 613.0046 668.4242 668.7060 673.4143 684.3824 696.8098 696.9804 745.0007 762.0943 764.7505 772.4030 792.3937 792.7866 799.8020 827.6302 859.6623 863.7362 863.8163 868.5346 905.5914 925.7483 937.7313 940.5235 941.2630 955.1850 955.3532 985.3119 988.8708 991.2594 995.0587 995.7379 995.8320 1010.3451 1010.3802 1022.3102 1027.9877 1028.0364 1053.6147 1064.3672 1087.0204 1087.1764 1089.4417 1102.9053 1132.5338 1159.7424 1176.2058 1176.2172 1181.6744 1186.7626 1188.9084 1209.1989 1226.6745 1228.1645 1236.3147 1236.9631 1266.3697 1275.9842 1312.7719 1315.7315 1320.0732 1320.2408 1335.8687 1351.1451 1354.2886 1358.3127 1390.2850 1390.3905 1417.6429 1418.7865 1439.1110 1439.1955 1475.8412 1477.7903 1477.8683 1479.1580 1502.4347 1507.9003 1587.1536 1587.2128 1604.7581 1607.5315 1610.8346 1610.9923 1673.2600 1674.0959 2968.5473 2969.4389 2979.4882 2980.6952 2988.5862 2993.3838 3028.8724 3031.1614 3041.3409 3051.6582 3133.6822 3133.7132 3146.1325 3146.1493 3157.8213 3157.8535 3169.3928 3169.4447 3183.9195 3184.0432 3553.7352 3554.8893
redmass: 5.4591 5.9890 5.3338 4.8644 7.2371 5.8462 5.8997 6.3554 7.7198 9.5863 6.5363 4.3434 6.6575 5.9327 5.2648 4.8224 4.5781 3.8996 6.0348 3.8133 4.1676 4.1159 3.4861 5.6358 5.9884 1.9345 1.9370 3.1573 2.9694 2.8122 2.8136 3.5631 4.3387 3.9008 2.4506 5.4239 6.2185 4.2427 4.4587 2.5966 4.1131 4.5359 6.4309 6.3829 5.2022 5.1145 6.5556 5.8250 1.6795 1.6770 3.1842 7.3711 8.9735 3.0776 2.1229 2.1329 3.7417 2.2672 2.9197 1.2489 1.2506 2.2048 2.0268 2.7075 4.2703 6.7894 5.7389 1.4259 1.4246 4.7710 5.8214 5.6315 4.2242 1.4055 1.4648 1.3353 1.3355 2.7341 2.1038 2.1051 1.7725 1.8895 1.5692 1.5700 1.7997 1.3759 1.4066 1.9742 1.0579 1.0577 2.0490 1.1425 1.2679 1.6949 2.9624 3.6205 1.5243 1.5464 1.3503 1.5078 1.4344 1.6729 1.3075 1.3068 1.3229 1.3954 1.3932 1.4386 9.8599 9.8704 1.5533 1.5742 2.2471 2.2473 1.0826 2.1784 2.2012 1.1129 1.0839 1.0842 6.2581 6.2554 10.1271 9.9888 6.0489 6.1215 12.0638 12.1695 1.0649 1.0649 1.0641 1.0668 1.0788 1.0814 1.0971 1.0954 1.0984 1.1017 1.0858 1.0858 1.0893 1.0892 1.0941 1.0941 1.0988 1.0988 1.0975 1.0975 1.0799 1.0799
irintensity: 0.1387 0.6852 2.2807 0.8245 0.1295 3.2115 0.9136 1.6686 0.0867 2.9551 13.9384 0.7717 1.0813 14.7370 3.9613 0.2075 7.8398 0.0981 1.6575 10.0163 1.3012 7.1487 15.4526 4.8024 41.9274 118.1318 52.1075 28.7703 1.3143 0.0240 0.0320 0.3089 12.6257 1.2494 10.8043 0.8786 5.7055 9.9572 4.0843 6.1022 0.4479 14.0224 0.2624 1.3682 16.8812 16.2376 1.7389 25.6186 47.1395 104.3977 11.6202 6.5726 137.0516 2.8021 15.5297 48.3365 3.1160 2.4104 0.6880 0.1018 0.0962 5.5015 27.5774 22.3638 0.6877 323.1618 40.3135 10.0721 4.6639 231.5517 2.2713 33.5877 8.1110 0.3473 0.9969 0.2208 0.0567 36.2862 3.1532 2.2389 1.3368 0.1071 10.9318 9.5682 0.1314 0.0057 49.9536 0.9988 0.9093 0.2870 1.0230 102.9044 0.0707 36.8651 366.0722 10.3166 5.6051 6.1683 2.8877 0.2713 2.5613 0.2700 1.7058 1.7217 0.3249 0.2555 0.9297 2.4286 4.6162 4.7747 50.4460 287.8948 19.1775 19.7064 6.4759 6.3380 3.3730 6.7004 33.4568 24.5012 11.2204 8.5954 147.0933 126.4334 50.3906 17.3181 216.3040 176.4791 52.0878 8.9283 37.5078 21.6479 86.2197 5.1478 44.3461 16.7798 29.5209 66.5193 0.3458 0.3263 8.1261 8.7808 15.7189 15.4791 31.0801 14.0275 6.0382 5.7497 25.6268 25.6577
temp: 298.150 k
press: 1.00000 atm
elementType: 8 8 8 8 8 8 7 7 6 6 6 6 6 6 6 6 6 6 6 6 6 6 6 6 6 6 6 6 6 6 1 1 1 1 1 1 1 1 1 1 1 1 1 1 1 1 1 1 1 1 1 1
symmnumber: 1
zpe: 1058880.5 jmol-1
zpe.correction: 0.403306 hartree
zpe.thermalcorrener: 0.430869 hartree
zpe.thermalcorrenthalpy: 0.431813 hartree
zpe.thermalcorrgfe: 0.339374 hartree
zpe.sumelectzpe: -1410.160057 hartree
zpe.sumelectthermal: -1410.132495 hartree
zpe.sumelectthermalent: -1410.131550 hartree
zpe.sumelectthermalfe: -1410.223989 hartree
dipole: -0.0221 1.8030 0.1012
dipole: 1.8059
quadrupole: -100.1624 -174.9357 -170.1131
quadrupole: -0.1139 -2.4357 -0.4674
quadrupole: 48.2414 -26.5320 -21.7094 -0.1139 -2.4357 -0.4674
hfenergy: -1410.5633633 hartree
pointgroup: C01 [X(C22H22N2O6)]
dipole: 0.0101704 0.7096662 -0.0329995 debye
polarizability: 419.960008|-0.2231782|230.3455133|36.4307481|1.3240921|180.4062956 unknown
InChI: InChI=1S/C22H22N2O6/c25-19(23-29-21(27)15-9-3-1-4-10-15)17-13-7-8-14-18(17)20(26)24-30-22(28)16-11-5-2-6-12-16/h1-6,9-12,17-18,23-24H,7-8,13-14H2
charge 0 multiplicity 1
52 atoms
O  -2.284888 -1.227279 -0.706393
O  2.271889 -1.243776 0.736714
O  -4.179887 -0.464089 1.156946
O  4.180872 -0.491092 -1.123682
O  -4.134725 1.553386 -0.074418
O  4.120302 1.514353 0.126818
N  -2.772791 -0.275214 1.35444
N  2.774546 -0.305597 -1.327606
C  -0.405931 -0.365871 0.669295
C  0.402369 -0.400781 -0.660758
C  -0.128259 0.954879 1.445834
C  0.12796 0.879855 -1.502229
C  -0.411106 2.215248 0.592679
C  0.418149 2.179814 -0.714052
C  -1.8894 -0.648537 0.34412
C  1.88452 -0.674875 -0.322057
C  -4.766417 0.543052 0.283426
C  4.761005 0.514749 -0.244553
C  -6.169474 0.185753 -0.034138
C  6.169612 0.169716 0.062821
C  -6.965871 1.159052 -0.695159
C  6.947515 1.131442 0.761689
C  -6.717185 -1.083922 0.290351
C  6.742027 -1.075126 -0.311672
C  -8.30436 0.865594 -1.022507
C  8.291581 0.851305 1.077721
C  -8.057282 -1.370321 -0.042272
C  8.087972 -1.347783 0.008427
C  -8.852257 -0.398374 -0.695361
C  8.864163 -0.387342 0.699996
H  -0.049912 -1.211888 1.292182
H  0.043593 -1.275416 -1.240933
H  0.939422 0.941215 1.736647
H  -0.687524 0.988239 2.403191
H  -0.940591 0.855703 -1.788296
H  0.682551 0.862403 -2.46285
H  -0.158374 3.120845 1.176181
H  -1.490188 2.276086 0.344719
H  0.17107 3.056984 -1.341659
H  1.496925 2.247252 -0.466125
H  -2.543022 0.366872 2.114977
H  2.547453 0.325608 -2.09784
H  -6.520307 2.127889 -0.943941
H  6.483397 2.081033 1.0479
H  -6.089613 -1.830742 0.783401
H  6.129548 -1.813817 -0.834982
H  -8.919221 1.615251 -1.531551
H  8.891759 1.591795 1.61681
H  -8.480684 -2.350262 0.20162
H  8.530729 -2.308143 -0.275685
H  -9.892707 -0.626026 -0.952759
H  9.909246 -0.604404 0.947573
