program: Gaussian 09
title: 000241417
version: EM64L-G09RevD.01
frameworkgroup: C1[X(C12H12N2O3S)]
method: RPBEPBE
basis: SDD
operation: Freq
keyword: #p
keyword: freq=noraman
keyword: PBEPBE/SDD
title: #p freq=noraman PBEPBE/SDD
converged: YES YES NO NO
title: Mulliken charges:
elementType: S O O O N N C C C C C C C C C C C C H H H H H H H H H H H H
charge: 0.276824 -0.289896 -0.246073 -0.271483 0.032559 -0.160197 -0.274252 -0.356779 0.106118 0.388944 0.232978 -0.343295 -0.387782 -0.225613 -0.229503 -0.196528 -0.252099 -0.666754 0.256054 0.256513 0.260565 0.254429 0.232300 0.232190 0.226969 0.230157 0.230191 0.212280 0.235673 0.235511
chargesum: 0.00000
title: Mulliken charges with hydrogens summed into heavy atoms:
elementType: S O O O N N C C C C C C C C C C C C
charge: 0.276824 -0.289896 -0.246073 -0.271483 0.032559 -0.160197 0.238315 -0.356779 0.106118 0.388944 0.232978 -0.082730 -0.133353 0.238877 -0.002534 0.033630 -0.021908 0.016709
polarizability: 2.57006747e+02 -3.51937623e+00 1.94530560e+02 -1.17632706e-01 4.41825536e-01 7.83234161e+01
1716.lowfreq: -6.7950 -2.9999 0.0007 0.0011 0.0017 3.4344 21.3612 33.8567 42.8022
frequency: 21.2598 33.8405 42.8010 43.7627 71.7692 89.8851 101.2108 123.9385 171.5911 177.3050 185.1745 225.6240 242.9131 271.2837 275.2835 298.4754 337.6687 368.2472 412.2583 450.5506 485.4321 486.8386 502.5885 555.4632 606.5595 610.0924 644.5437 693.6133 697.9314 732.4913 759.0905 762.6332 793.2689 799.2398 807.2319 827.3295 894.8666 937.6814 963.0761 973.0960 981.9310 985.5910 998.9682 1021.1394 1024.9356 1085.4230 1114.0588 1134.6096 1138.9598 1160.2556 1169.3670 1184.6125 1193.8278 1216.4918 1249.2986 1286.3216 1317.7350 1333.6523 1363.4739 1387.9744 1404.2438 1426.8479 1444.0707 1451.9741 1463.0037 1472.0563 1476.3273 1481.3866 1486.2291 1586.3779 1594.0475 1611.7094 2962.5893 2999.5956 3011.5480 3013.2124 3072.1951 3096.2925 3112.6186 3131.2460 3140.4111 3157.4351 3165.9711 3174.9956
redmass: 3.6019 3.6156 4.5864 5.3181 4.9597 3.8703 5.3313 4.3008 2.9474 7.4535 5.5968 3.3816 1.5424 7.0293 3.5957 10.3072 8.1501 4.6337 2.9339 5.7999 6.9708 8.0122 2.9442 9.6925 10.5464 6.4631 7.2478 2.1093 6.9265 9.9816 1.6079 10.8133 6.8856 1.1036 4.0846 1.2493 1.4374 7.6868 1.4159 1.6129 6.1022 1.3047 6.8025 2.4143 2.1839 1.5387 2.2458 1.4562 6.8444 4.6007 1.1439 1.2146 1.0562 3.8315 1.1375 3.8038 1.3338 1.4792 1.6932 7.0548 1.2686 1.1510 2.4081 4.1079 1.0395 1.1590 4.0402 2.8967 1.0870 10.8276 6.3483 6.3612 1.0561 1.0362 1.0579 1.1029 1.1070 1.0985 1.1026 1.0849 1.0891 1.0926 1.0957 1.1006
irintensity: 0.0008 0.3753 0.0238 0.1345 0.8065 3.4922 1.6382 3.6817 9.4521 0.1785 6.1838 1.1359 0.4732 6.2948 0.3042 42.3430 3.2457 9.3110 0.0098 5.0176 4.8088 1.2369 12.9454 1.1996 4.5407 0.7114 5.8391 30.6072 4.8153 6.7042 94.4482 25.0622 9.6908 3.8482 10.3530 0.2223 8.4244 187.4199 0.4276 0.4120 5.9191 0.7108 49.9742 103.3045 25.9665 8.3259 5.1919 6.2397 123.9872 345.0935 11.7891 12.1197 0.0622 211.5547 0.0260 113.5815 2.8893 71.8570 8.4882 22.5122 26.8607 17.4318 19.2163 61.9220 12.5531 53.3885 333.4959 3.4648 16.1212 170.8187 20.8251 79.0468 29.6417 20.1966 17.0250 7.9852 8.8817 25.7751 38.1939 2.4473 11.6784 33.9075 13.9312 5.8446
temp: 298.150 k
press: 1.00000 atm
elementType: 16 8 8 8 7 7 6 6 6 6 6 6 6 6 6 6 6 6 1 1 1 1 1 1 1 1 1 1 1 1
symmnumber: 1
zpe: 578770.8 jmol-1
zpe.correction: 0.220442 hartree
zpe.thermalcorrener: 0.237938 hartree
zpe.thermalcorrenthalpy: 0.238882 hartree
zpe.thermalcorrgfe: 0.172129 hartree
zpe.sumelectzpe: -1196.353964 hartree
zpe.sumelectthermal: -1196.336469 hartree
zpe.sumelectthermalent: -1196.335525 hartree
zpe.sumelectthermalfe: -1196.402278 hartree
dipole: 0.1180 -3.3704 -0.0021
dipole: 3.3725
quadrupole: -96.3548 -112.4327 -113.4763
quadrupole: -12.3111 0.0277 0.0453
quadrupole: 11.0664 -5.0114 -6.0550 -12.3111 0.0277 0.0453
hfenergy: -1196.5744066 hartree
pointgroup: C01 [X(C12H12N2O3S1)]
dipole: 0.0888259 1.0995317 -0.7373387 debye
polarizability: 254.6224242|-15.5673433|160.6316426|-5.7668725|-53.541419|114.6066557 unknown
InChI: InChI=1S/C12H12N2O3S/c1-2-16-12(15)11-10(18-14-13-11)8-17-9-6-4-3-5-7-9/h3-7H,2,8H2,1H3
charge 0 multiplicity 1
30 atoms
S  -0.511802 -2.252749 1.818401
O  1.723404 -0.819983 0.677501
O  -3.755848 1.061834 -0.074958
O  -1.557108 1.60582 -0.654124
N  -2.944242 -1.171102 1.320492
N  -2.588618 -2.193794 1.965516
C  0.522708 -0.084835 0.284047
C  -0.66954 -0.793033 0.864057
C  -2.002714 -0.349857 0.690892
C  2.962657 -0.315268 0.225601
C  -2.388934 0.853833 -0.071948
C  3.10629 0.844885 -0.573817
C  4.095132 -1.061369 0.630767
C  -4.232694 2.267259 -0.829477
C  4.404833 1.250244 -0.964385
C  5.379701 -0.642433 0.232314
C  5.542978 0.515649 -0.567733
C  -5.749292 2.294684 -0.683948
H  0.427151 -0.032816 -0.820046
H  0.55283 0.961689 0.650781
H  2.240359 1.431753 -0.89449
H  3.947172 -1.952524 1.248107
H  -3.744208 3.158964 -0.396996
H  -3.904832 2.166769 -1.879858
H  4.519165 2.147393 -1.582947
H  6.255363 -1.220883 0.546622
H  6.542999 0.837867 -0.875658
H  -6.159342 3.167369 -1.224011
H  -6.202233 1.380656 -1.103469
H  -6.042136 2.371774 0.376669
