program: Gaussian 09
title: 000241392
version: EM64L-G09RevD.01
frameworkgroup: C1[X(C24H21NO3)]
method: RPBEPBE
basis: SDD
operation: Freq
keyword: #p
keyword: freq=noraman
keyword: PBEPBE/SDD
title: #p freq=noraman PBEPBE/SDD
converged: YES YES NO NO
title: Mulliken charges:
elementType: O O O N C C C C C C C C C C C C C C C C C C C C C C C C H H H H H H H H H H H H H H H H H H H H H
charge: -0.269936 -0.274647 -0.279976 -0.108821 0.378238 0.371632 -0.391431 -0.300021 0.382189 0.383866 0.411855 0.362948 -0.576797 -0.543855 -0.446700 -0.418257 -0.357687 -0.361177 -0.406709 -0.396511 -0.415943 -0.412993 0.263116 -0.250666 -0.249484 -0.249966 -0.246696 -0.779417 0.264645 0.257384 0.252120 0.225560 0.265953 0.274735 0.238682 0.235560 0.281143 0.235758 0.241003 0.247842 0.239325 0.237912 0.227226 0.228282 0.226462 0.227417 0.266612 0.231048 0.279176
chargesum: 0.00000
title: Mulliken charges with hydrogens summed into heavy atoms:
elementType: O O O N C C C C C C C C C C C C C C C C C C C C C C C C
charge: -0.269936 -0.274647 -0.279976 -0.108821 0.378238 0.371632 0.130598 0.177659 0.382189 0.383866 0.411855 0.362948 -0.310843 -0.269120 -0.208018 -0.182697 -0.076544 -0.125419 -0.165706 -0.148669 -0.176618 -0.175081 0.263116 -0.023439 -0.021202 -0.023504 -0.019279 -0.002581
polarizability: 3.65955982e+02 5.41540205e+01 3.11137602e+02 2.49447949e+01 -4.77417591e+01 1.69519031e+02
1716.lowfreq: -7.2372 -2.5160 0.0001 0.0002 0.0008 5.5552 10.6253 17.3249 25.8480
frequency: 8.6534 17.1085 25.7375 30.4788 54.6040 67.0906 83.1180 99.8449 106.6903 132.6099 158.5542 165.7618 174.5880 186.9101 191.8298 237.9841 269.8434 291.4994 306.9063 320.6742 344.0770 373.7816 388.2259 404.1606 404.8015 413.3811 457.1325 476.0291 478.1674 493.7287 501.0701 514.7219 518.1221 529.7313 536.6867 566.6598 585.5694 599.3567 616.3554 623.6292 647.8761 649.7874 679.6642 708.4796 755.7993 756.9853 758.2214 759.4833 773.7074 777.4088 800.2338 813.5048 825.6859 846.7703 862.6727 866.9423 869.0584 899.6597 907.3030 922.4902 934.1314 942.1660 945.2762 953.3579 956.4168 967.7990 970.6048 974.5066 988.9960 990.8033 996.3858 1021.7900 1022.1131 1038.7167 1044.3984 1108.0511 1121.4667 1126.6210 1153.1053 1158.1372 1159.4659 1170.4825 1173.0976 1174.7523 1204.0781 1232.0631 1238.8542 1246.3161 1251.6548 1254.5900 1273.1374 1273.9809 1284.0130 1352.8925 1357.7898 1359.7400 1376.8927 1383.7051 1398.5722 1409.4619 1410.7574 1421.6391 1423.0039 1438.0963 1439.1717 1449.0163 1461.7862 1463.9234 1473.9798 1478.7890 1483.0950 1512.9689 1516.3066 1578.1561 1579.7419 1603.2400 1603.6545 1610.2127 1641.4250 1643.2804 2992.6378 3002.2491 3034.6188 3067.6504 3084.3074 3102.3691 3118.3823 3118.9482 3123.8404 3124.2117 3125.8217 3128.0253 3136.4888 3140.8246 3142.1927 3150.2116 3151.1945 3152.4875 3160.1493 3160.2477 3161.5968
redmass: 6.0846 5.8567 4.7397 4.5024 4.6617 5.6153 5.3595 4.3335 5.9055 5.7339 5.9149 4.0496 1.1254 3.6622 3.7987 4.4673 5.8021 4.9800 5.4698 3.2521 5.0030 4.1403 2.4932 3.2719 3.2658 4.1466 4.5788 2.5326 2.5364 3.9951 6.3468 6.1254 5.7811 3.6252 3.9550 3.6135 3.8419 4.7009 6.3776 5.7772 2.9253 3.0531 6.0295 5.9025 1.3339 4.4706 1.3229 4.7329 2.3724 2.5717 4.2046 1.5456 1.3506 4.8387 3.1701 1.8402 1.5566 1.7567 1.6637 5.7376 4.6871 2.3889 1.5918 3.8934 1.3871 1.4812 2.2641 1.6041 1.3345 1.3359 1.9589 2.2713 2.2570 1.7747 1.6716 1.9868 1.8174 1.7914 1.7399 1.7338 1.2448 1.1410 1.0830 1.1957 1.9583 2.0907 2.1766 1.7585 1.4856 1.8974 1.7335 1.7579 1.7188 1.6870 1.6078 1.7833 1.3458 1.2323 1.8213 5.4203 3.3237 3.3852 3.6222 3.8435 3.7305 1.1001 2.2393 2.3431 1.0606 1.0868 1.1331 3.5992 3.5672 7.5126 7.4370 5.7328 5.7300 7.0021 6.9544 6.9819 1.0393 1.0550 1.0563 1.1101 1.0963 1.1098 1.0854 1.0861 1.0888 1.0877 1.0882 1.0880 1.0996 1.0951 1.0951 1.0952 1.0962 1.0940 1.0942 1.1002 1.0985
irintensity: 0.1509 0.1442 0.5226 0.2046 1.0638 0.4317 1.1861 10.7105 1.2542 2.2204 5.3698 0.9556 0.2667 2.3527 1.4306 9.5006 0.3068 4.0850 3.8660 2.2695 3.9639 1.5954 4.0416 0.9879 0.3786 1.5531 10.4085 39.2121 7.0511 14.3914 2.2803 2.4877 0.2714 0.5837 0.1121 3.8068 28.7790 13.8571 0.9546 4.3724 3.6636 0.9551 4.9402 5.1789 56.8896 3.2614 19.5753 1.8035 6.5280 1.3636 32.4300 50.2130 43.8993 22.3835 34.2366 72.9629 9.4692 33.4334 1.6064 84.0332 1.3969 33.6071 7.5398 142.0123 5.6984 18.3615 168.6691 62.9202 0.5875 0.1693 33.4659 1.7403 2.6322 52.2823 8.4086 55.0457 91.4929 7.3210 122.8729 112.0838 67.6343 4.0220 1.6935 2.6815 45.6111 117.4475 44.9657 80.7238 23.7312 89.4104 9.1810 4.4740 50.4226 76.1478 51.7036 4.8554 48.9174 50.2154 56.0023 1.6945 8.8984 2.5037 0.7484 3.8655 2.1649 58.7181 15.4839 25.4645 16.0559 9.9811 27.1485 50.1553 57.1103 5.7354 6.2332 91.3051 41.6548 164.8912 20.4854 75.3757 2.7160 47.9243 45.0321 22.2417 5.4439 8.1065 5.0507 1.9035 1.6785 8.3668 2.2329 9.8792 6.8325 44.8975 19.0909 14.6258 22.9797 0.9751 21.3860 26.2305 21.7849
temp: 298.150 k
press: 1.00000 atm
elementType: 8 8 8 7 6 6 6 6 6 6 6 6 6 6 6 6 6 6 6 6 6 6 6 6 6 6 6 6 1 1 1 1 1 1 1 1 1 1 1 1 1 1 1 1 1 1 1 1 1
symmnumber: 1
zpe: 1018253.5 jmol-1
zpe.correction: 0.387832 hartree
zpe.thermalcorrener: 0.411467 hartree
zpe.thermalcorrenthalpy: 0.412412 hartree
zpe.thermalcorrgfe: 0.331632 hartree
zpe.sumelectzpe: -1205.627807 hartree
zpe.sumelectthermal: -1205.604172 hartree
zpe.sumelectthermalent: -1205.603228 hartree
zpe.sumelectthermalfe: -1205.684007 hartree
dipole: 1.7304 -3.1610 0.0277
dipole: 3.6038
quadrupole: -164.5902 -138.7206 -164.6691
quadrupole: 7.9329 3.8118 -9.3727
quadrupole: -8.5969 17.2727 -8.6758 7.9329 3.8118 -9.3727
hfenergy: -1206.0156393 hartree
pointgroup: C01 [X(C24H21N1O3)]
dipole: 1.3785704 -0.1647465 0.2875302 debye
polarizability: 255.9446147|19.3612778|394.5463738|67.6151874|-28.3188791|196.1216261 unknown
InChI: InChI=1S/C24H21NO3/c1-18(26)25(16-27-23-12-10-19-6-2-4-8-21(19)14-23)17-28-24-13-11-20-7-3-5-9-22(20)15-24/h2-15H,16-17H2,1H3
charge 0 multiplicity 1
49 atoms
O  -1.165388 -1.693792 2.010172
O  1.198677 -1.798524 -0.10111
O  -1.7610 -4.782709 -0.268149
N  -0.10952 -3.557327 0.827926
C  -2.385292 1.289403 0.178918
C  2.367376 1.723512 -0.090914
C  -1.04915 -3.147237 1.884664
C  1.206414 -2.950063 0.836322
C  -3.224162 0.702112 -0.849071
C  3.601062 1.632175 0.66833
C  -1.862838 -0.953797 1.021857
C  2.014251 -0.685504 0.19959
C  -1.717111 0.432972 1.107462
C  1.591196 0.544338 -0.311595
C  -3.349379 -0.724141 -0.896957
C  4.002828 0.352851 1.17195
C  -2.684537 -1.549818 0.012191
C  3.233882 -0.791097 0.946372
C  -2.242466 2.718412 0.222741
C  1.952483 3.006313 -0.587299
C  -3.889927 1.562737 -1.783462
C  4.374315 2.819664 0.89058
C  -0.570404 -4.352767 -0.245477
C  -2.902146 3.529709 -0.703004
C  2.726332 4.144149 -0.352107
C  -3.734669 2.949153 -1.714878
C  3.948873 4.052112 0.390506
C  0.431726 -4.673464 -1.345693
H  -2.01326 -3.642056 1.681079
H  -0.662639 -3.443287 2.87367
H  1.430625 -2.59618 1.858709
H  1.974496 -3.671018 0.503743
H  -1.071472 0.854826 1.884665
H  0.649375 0.594038 -0.866727
H  -3.978699 -1.176198 -1.672699
H  4.938077 0.27583 1.739206
H  -2.78908 -2.636727 -0.066487
H  3.576789 -1.761812 1.320292
H  -1.606475 3.163961 0.997268
H  1.016612 3.076718 -1.154549
H  -4.524806 1.113909 -2.557154
H  5.307149 2.745727 1.462785
H  -2.78745 4.618622 -0.658087
H  2.401532 5.11736 -0.736753
H  -4.247444 3.598731 -2.432711
H  4.54563 4.954218 0.564183
H  -0.107355 -5.194307 -2.149847
H  1.233811 -5.339392 -0.97524
H  0.897861 -3.756433 -1.744511
