program: Gaussian 09
title: 000241391
version: EM64L-G09RevD.01
frameworkgroup: C1[X(C24H19Cl3O5)]
method: RPBEPBE
basis: SDD
operation: Freq
keyword: #p
keyword: freq=noraman
keyword: PBEPBE/SDD
title: #p freq=noraman PBEPBE/SDD
converged: YES YES NO NO
title: Mulliken charges:
elementType: Cl Cl Cl O O O O O C C C C C C C C C C C C C C C C C C C C C C C C H H H H H H H H H H H H H H H H H H H
charge: -0.058722 -0.068929 -0.036753 -0.424061 -0.420190 -0.515577 -0.235844 -0.312970 0.350185 0.396703 -0.733473 -0.770946 -0.069087 0.477849 0.408263 -0.436791 -0.354741 -0.136085 -0.027475 0.071186 -0.390108 -0.343948 0.192241 0.169627 -0.124172 -0.155078 -0.335911 -0.302165 0.113132 0.224740 -0.743605 -0.779665 0.246394 0.241650 0.241408 0.271779 0.293858 0.252422 0.259931 0.266722 0.308745 0.273222 0.419335 0.380403 0.403348 0.246326 0.248549 0.240240 0.251827 0.251355 0.274862
chargesum: 0.00000
title: Mulliken charges with hydrogens summed into heavy atoms:
elementType: Cl Cl Cl O O O O O C C C C C C C C C C C C C C C C C C C C C C C C
charge: -0.058722 -0.068929 -0.036753 -0.004726 -0.039788 -0.112230 -0.235844 -0.312970 0.350185 0.396703 -0.245430 -0.257760 -0.069087 0.477849 0.408263 -0.142934 -0.102319 -0.136085 -0.027475 0.071186 -0.130178 -0.077226 0.192241 0.169627 -0.124172 -0.155078 -0.027166 -0.028943 0.113132 0.224740 -0.008490 -0.001621
polarizability: 3.79434194e+02 -1.62685829e+01 3.94830172e+02 2.61421514e+01 1.62537238e+01 1.92215237e+02
1716.lowfreq: -5.1424 -2.2616 -0.0017 -0.0016 -0.0013 2.8133 7.7272 12.5666 20.0250
frequency: 5.8147 12.5189 19.9485 29.9972 33.5133 37.4301 48.8045 83.4464 85.9370 114.8941 124.7516 126.6798 130.5602 142.7581 146.3366 153.1396 163.7438 172.7787 178.7084 190.5007 199.5859 226.5130 240.0868 253.2105 293.8567 314.0720 324.1998 331.1119 341.9801 343.4253 348.1936 357.0239 360.6157 363.2430 376.5530 390.3619 401.4371 436.0463 443.1093 459.6009 473.1048 507.0125 517.8575 529.8545 539.9794 545.6689 558.8170 560.6435 570.4740 575.3636 580.4412 595.7988 608.6766 631.0085 643.6811 681.1487 702.3419 711.8607 726.6462 743.8804 766.9828 778.1307 801.1716 833.1147 839.3544 857.7477 872.6614 875.8446 882.1003 892.2107 898.7276 913.8254 919.6737 931.6348 935.5905 939.6742 971.4128 984.2570 990.8371 1029.5760 1029.6923 1065.2311 1089.3350 1095.3994 1105.2781 1113.6720 1134.6866 1163.5765 1173.6797 1186.1247 1204.6123 1216.1594 1236.7796 1244.0823 1261.1133 1263.6696 1264.0272 1272.5459 1303.9083 1312.5285 1314.5755 1333.6259 1351.5274 1376.8492 1383.4173 1390.1579 1397.5057 1402.4276 1409.7369 1414.9125 1420.3367 1426.2885 1437.1217 1441.7403 1445.3230 1450.6741 1456.9723 1458.3252 1466.9089 1487.5203 1561.4343 1565.9232 1581.4976 1588.3770 1597.6833 1598.4754 1604.4238 1625.5508 2392.4327 2980.8902 2993.2243 2997.4552 3004.8710 3052.4990 3061.1100 3065.7553 3075.1171 3084.2111 3125.1507 3134.1551 3139.5714 3147.7605 3157.5216 3160.6656 3164.8635 3177.9100 3429.2908
redmass: 10.1117 8.2293 11.2432 7.9785 8.7045 4.3516 7.4216 5.8139 5.8301 2.6395 12.1688 1.5751 8.6488 7.6816 8.9360 7.4940 6.7123 6.6510 6.2651 4.3815 1.0538 4.8253 5.3376 3.9901 3.1159 5.0783 3.2098 5.8391 5.2620 6.1851 7.8512 12.1445 12.2478 7.2956 4.2775 6.8583 5.7660 4.2389 4.2317 6.3309 4.3234 3.8013 3.8684 1.4089 3.1820 3.8368 4.9556 2.8034 3.7305 4.2862 4.9010 3.4880 3.3828 4.5474 4.5916 5.9220 6.1771 4.4606 6.2298 4.9606 4.1092 4.7260 1.2366 7.0370 7.1864 4.3986 1.6771 1.5381 1.5947 1.7056 2.1361 2.9317 2.0679 2.1048 1.7129 1.5419 1.9840 1.9518 3.0248 1.7605 1.8260 1.0719 2.0432 1.8021 1.7758 2.4086 2.4621 2.2846 1.5348 1.3387 2.4275 2.5981 1.6402 1.5336 1.9385 1.8645 2.8686 3.3091 1.9124 1.8291 1.5879 2.4848 2.4733 1.2500 1.3263 4.5085 6.0548 3.0512 3.7357 4.1204 2.8080 1.3024 1.5590 1.6061 1.0503 1.7165 1.5401 1.0563 1.6071 1.4047 4.4702 6.8683 6.3723 5.0677 7.4482 7.6926 5.8172 3.4142 1.0800 1.0629 1.0385 1.0358 1.0608 1.0974 1.0738 1.1008 1.0965 1.0952 1.1027 1.0990 1.0921 1.0926 1.0927 1.0928 1.0922 1.0924 1.0661
irintensity: 0.1019 0.0608 0.7222 0.1159 1.4000 3.7882 1.2089 2.5767 2.9692 2.6827 1.1271 0.0583 0.3914 0.9346 0.6941 0.8465 7.9850 3.7632 1.2684 0.0665 0.5744 0.8707 7.0194 1.2222 1.5906 7.6916 2.7403 4.5145 0.3258 4.9561 0.1233 0.9229 3.7587 1.2462 0.1764 8.9653 2.5777 0.9551 2.3948 14.2609 2.4647 14.6629 7.2430 64.9511 8.1104 1.0109 18.1941 28.5449 29.9108 14.8461 11.1073 2.1081 0.8739 49.7191 6.5644 7.1045 29.3221 51.3348 23.5670 16.1758 15.2671 32.9253 114.7018 5.6241 21.1178 14.3008 16.2279 35.8933 45.8415 4.1322 18.3882 30.6219 6.5700 3.7684 25.3852 20.7833 20.0005 17.1096 4.9790 9.2114 3.2581 139.3750 1.6403 0.8382 1.4143 8.9344 33.1869 50.5336 38.6177 30.1049 8.9840 106.0827 11.7817 2.8580 9.3939 38.8106 125.8718 106.5299 133.2322 84.3359 4.0494 114.1180 69.5397 40.3096 38.2895 24.5522 31.3360 27.6235 136.2804 19.2009 65.8270 19.3485 16.4412 298.3680 17.5511 107.7203 167.0097 24.2441 87.1073 26.0422 19.8399 144.5290 1.8143 3.0649 14.1661 23.2178 6.1149 117.4969 688.6770 24.6052 1.3388 3.0957 12.2095 1.0282 1437.6996 34.0346 5.6900 7.7565 23.9165 7.4682 0.8384 4.4508 1.5793 0.8937 10.8091 0.1753 524.2604
temp: 298.150 k
press: 1.00000 atm
elementType: 17 17 17 8 8 8 8 8 6 6 6 6 6 6 6 6 6 6 6 6 6 6 6 6 6 6 6 6 6 6 6 6 1 1 1 1 1 1 1 1 1 1 1 1 1 1 1 1 1 1 1
symmnumber: 1
zpe: 967749.9 jmol-1
zpe.correction: 0.368596 hartree
zpe.thermalcorrener: 0.398797 hartree
zpe.thermalcorrenthalpy: 0.399741 hartree
zpe.thermalcorrgfe: 0.302998 hartree
zpe.sumelectzpe: -2680.014128 hartree
zpe.sumelectthermal: -2679.983928 hartree
zpe.sumelectthermalent: -2679.982983 hartree
zpe.sumelectthermalfe: -2680.079727 hartree
dipole: -11.2823 0.0616 -1.7051
dipole: 11.4106
quadrupole: -225.0868 -216.6230 -204.2943
quadrupole: 31.7395 -13.7945 7.1205
quadrupole: -9.7521 -1.2883 11.0404 31.7395 -13.7945 7.1205
hfenergy: -2680.3827243 hartree
pointgroup: C01 [X(C24H19Cl3O5)]
dipole: 4.3385419 0.9153226 0.7020265 debye
polarizability: 372.522567|15.1878125|397.1764692|31.8750736|-27.3332445|196.7805672 unknown
InChI: InChI=1S/C24H19Cl3O5/c1-11(28)20-9-18(26)7-15(23(20)31)3-13-5-17(25)6-14(22(13)30)4-16-8-19(27)10-21(12(2)29)24(16)32/h5-10,30-32H,3-4H2,1-2H3
charge 0 multiplicity 1
51 atoms
Cl -0.797913 5.075356 0.592792
Cl -3.668002 -4.936971 0.91772
Cl 6.558214 2.636553 -0.367274
O  -0.016094 -0.878077 0.206457
O  -4.023677 1.009436 -0.026708
O  2.394401 -1.687283 -0.493702
O  -6.677061 -1.692071 -1.964311
O  4.019973 -3.249885 0.489431
C  -1.189066 1.003549 1.081616
C  0.622463 1.386306 -0.569723
C  -2.03886 0.035927 1.900692
C  1.6584 0.862674 -1.568468
C  -0.164558 0.49858 0.224301
C  -2.95684 -0.891218 1.100121
C  3.03913 0.588187 -0.976213
C  -1.367614 2.404033 1.193782
C  0.413528 2.782157 -0.448296
C  -0.560372 3.273371 0.435252
C  -3.936998 -0.372675 0.198875
C  3.36499 -0.698344 -0.46498
C  -2.884934 -2.284335 1.298033
C  4.034422 1.585935 -0.933311
C  -4.862171 -1.234245 -0.462189
C  4.669773 -0.990084 0.063435
C  -3.78963 -3.135546 0.634043
C  5.315088 1.308287 -0.39822
C  -4.768933 -2.635201 -0.22507
C  5.64924 0.044044 0.09305
C  -5.955914 -0.80407 -1.414923
C  4.949977 -2.351737 0.555452
C  -6.205605 0.663262 -1.714265
C  6.292928 -2.727704 1.134576
H  -1.36301 -0.602455 2.497198
H  -2.64971 0.624819 2.614339
H  1.771494 1.612183 -2.370975
H  1.282692 -0.062082 -2.044774
H  -2.111207 2.808996 1.889676
H  1.002762 3.47715 -1.055762
H  -2.123899 -2.699516 1.965489
H  3.816926 2.584937 -1.324996
H  -5.483168 -3.281478 -0.744249
H  6.648663 -0.148125 0.491568
H  0.864088 -1.205364 -0.18171
H  -3.180166 1.464637 0.24419
H  2.849343 -2.567865 -0.10499
H  -5.312854 1.127392 -2.169618
H  -6.393754 1.23209 -0.78687
H  -7.066918 0.741336 -2.395887
H  6.536348 -2.10264 2.013285
H  7.100198 -2.582597 0.393265
H  6.270486 -3.784132 1.439145
