program: Gaussian 09
title: 000242007
version: EM64L-G09RevD.01
frameworkgroup: C1[X(C14H13N3O2)]
method: RPBEPBE
basis: SDD
operation: Freq
keyword: #p
keyword: freq=noraman
keyword: PBEPBE/SDD
title: #p freq=noraman PBEPBE/SDD
converged: NO YES NO NO
title: Mulliken charges:
elementType: O O N N N C C C C C C C C C C C C C C H H H H H H H H H H H H H
charge: -0.291450 -0.219379 -0.407407 0.057720 -0.002338 0.283577 0.222440 -0.344146 -0.349022 -0.245514 -0.226646 -0.369399 0.277351 0.182586 -0.283640 -0.310800 -0.322555 -0.328152 -0.534513 0.286411 0.241280 0.233386 0.228632 0.247137 0.272648 0.224257 0.289626 0.247286 0.243525 0.226352 0.225967 0.244777
chargesum: 0.00000
title: Mulliken charges with hydrogens summed into heavy atoms:
elementType: O O N N N C C C C C C C C C C C C C C
charge: -0.291450 -0.219379 -0.117781 0.057720 -0.002338 0.283577 0.222440 -0.057735 -0.107742 -0.012127 0.001986 -0.122262 0.277351 0.182586 -0.010992 -0.086543 -0.075269 -0.084628 0.162584
polarizability: 3.64914987e+02 1.92881694e+00 1.94064728e+02 7.05382469e+00 -6.98358001e+00 8.22222253e+01
1716.lowfreq: -8.2299 -3.2211 -1.5815 -0.0009 -0.0007 -0.0003 21.2603 31.4159 38.8592
frequency: 21.1145 31.3796 38.8128 60.8810 99.5333 113.5908 119.4183 164.2862 174.7955 193.3609 226.6583 247.5999 272.4383 274.4281 336.6103 360.1312 366.9485 397.3838 429.2572 481.7245 498.1962 510.5554 543.0689 568.7574 627.6866 635.9967 659.9367 668.9528 688.6289 743.1360 752.5209 760.3479 762.5223 827.4404 837.8177 862.0035 890.0574 904.4238 951.9846 957.5590 961.9423 965.6260 987.1439 988.5637 995.2062 1025.5584 1043.1204 1060.9906 1085.2931 1099.9813 1113.5409 1133.3283 1152.4724 1175.2135 1207.4089 1218.4159 1237.3605 1242.7912 1296.9768 1299.6656 1322.2371 1330.4037 1389.6627 1399.4326 1430.8936 1449.1773 1460.6537 1467.6501 1469.5449 1483.4178 1509.4539 1546.3790 1563.0959 1580.6000 1592.5518 1607.8761 1620.4760 2966.3183 3020.5781 3057.0592 3125.3456 3127.1807 3135.4602 3140.9408 3149.1717 3151.4258 3164.5144 3173.9774 3174.4918 3380.2789
redmass: 4.4876 5.7243 5.5257 5.0783 3.3953 5.5505 4.9049 5.8204 5.3958 2.9574 2.3618 2.2545 3.7280 2.7537 4.2354 5.0992 3.0329 6.5409 5.5757 3.2225 6.6731 4.7881 3.4245 5.3832 2.2177 1.9679 6.0253 7.3962 4.4698 3.5720 2.9505 5.5513 1.2933 4.2767 1.8375 1.4112 1.2616 5.3714 1.3753 3.1010 1.4865 1.8980 1.4453 8.7746 1.3475 6.3028 2.1161 2.1500 1.6652 2.4196 1.2579 2.8312 1.3989 1.0931 1.9256 1.3353 2.4108 2.9408 1.5488 5.9386 1.6349 1.6444 5.9678 1.8978 1.4538 1.7437 1.8981 1.1408 1.2193 1.6126 1.8980 7.4959 6.1431 5.7318 6.1147 6.4040 8.5414 1.0325 1.0879 1.1043 1.0874 1.0999 1.0860 1.0896 1.0974 1.0899 1.0941 1.0965 1.1000 1.0751
irintensity: 0.2028 0.3922 0.2313 1.2388 8.5657 3.8807 11.6023 2.1762 4.7678 13.0078 9.9310 6.7542 2.3437 4.2460 0.3709 2.4524 1.8190 2.0947 11.6094 6.7027 4.2735 4.2545 1.0123 10.0523 30.5026 48.8600 1.9501 43.4021 25.2824 0.4472 9.4488 9.0057 94.3568 10.7570 33.0837 0.1700 3.6692 13.7466 3.0327 1.3500 28.0898 1.0430 2.8026 47.4952 2.2819 21.4500 13.0276 24.6758 36.3712 56.1314 0.1256 83.8828 5.6972 18.0899 37.7333 20.8660 189.8496 215.2022 23.3275 0.5046 9.1752 23.6455 55.6158 21.4008 30.8385 26.4221 15.6789 38.9737 51.5394 11.6092 243.6930 42.8517 19.8502 23.5949 63.4493 45.8310 180.9139 79.2814 37.3498 43.2320 10.6527 19.5598 0.7537 30.0409 15.8047 9.8445 14.1471 7.6384 24.4323 14.5481
temp: 298.150 k
press: 1.00000 atm
elementType: 8 8 7 7 7 6 6 6 6 6 6 6 6 6 6 6 6 6 6 1 1 1 1 1 1 1 1 1 1 1 1 1
symmnumber: 1
zpe: 642052.5 jmol-1
zpe.correction: 0.244545 hartree
zpe.thermalcorrener: 0.261423 hartree
zpe.thermalcorrenthalpy: 0.262367 hartree
zpe.thermalcorrgfe: 0.197623 hartree
zpe.sumelectzpe: -854.597421 hartree
zpe.sumelectthermal: -854.580543 hartree
zpe.sumelectthermalent: -854.579599 hartree
zpe.sumelectthermalfe: -854.644343 hartree
dipole: -5.2882 4.7660 0.3511
dipole: 7.1276
quadrupole: -101.8800 -104.4360 -113.5585
quadrupole: -8.7952 1.0748 -2.1825
quadrupole: 4.7449 2.1888 -6.9337 -8.7952 1.0748 -2.1825
hfenergy: -854.841966 hartree
pointgroup: C01 [X(C14H13N3O2)]
dipole: -1.9860816 -1.9792089 0.0439764 debye
polarizability: 363.9571375|5.5518464|193.0044571|-16.0373303|-14.1609074|84.240345 unknown
InChI: InChI=1S/C14H13N3O2/c1-19-13-5-3-2-4-12(13)10-16-17-14(18)11-6-8-15-9-7-11/h2-10,17H,1H3
charge 0 multiplicity 1
32 atoms
O  -3.18453 -2.148811 0.110394
O  2.073189 2.289304 -0.135452
N  1.08881 0.159631 0.026392
N  -0.205527 0.648671 0.088276
N  6.143374 -0.804549 -0.098469
C  -2.574566 0.173206 0.154554
C  -3.613132 -0.811873 0.162609
C  -2.941249 1.545695 0.205208
C  -4.972796 -0.425017 0.219038
C  -4.292775 1.934335 0.261707
C  -5.306417 0.946604 0.268212
C  -1.173697 -0.248101 0.090593
C  3.527219 0.347165 -0.050547
C  2.182042 1.037162 -0.050442
C  4.619483 1.037027 -0.632223
C  3.777695 -0.92434 0.527917
C  5.891929 0.427687 -0.638841
C  5.088505 -1.451571 0.479293
C  -4.207142 -3.198186 0.110154
H  -2.136094 2.287284 0.197294
H  -5.769247 -1.174522 0.224787
H  -4.557894 2.995604 0.299742
H  -6.360839 1.240955 0.311481
H  -0.985804 -1.336532 0.04283
H  4.458991 2.032134 -1.057265
H  2.996743 -1.4910 1.047753
H  1.257996 -0.856377 -0.029457
H  6.75329 0.933505 -1.088415
H  5.314361 -2.427118 0.924565
H  -4.86904 -3.112284 -0.772766
H  -4.812912 -3.167684 1.035978
H  -3.647667 -4.143904 0.063703
