program: Gaussian 09
title: 000241377
version: EM64L-G09RevD.01
frameworkgroup: C1[X(C14H20O3S)]
method: RPBEPBE
basis: SDD
operation: Freq
keyword: #p
keyword: freq=noraman
keyword: PBEPBE/SDD
title: #p freq=noraman PBEPBE/SDD
converged: YES YES NO NO
title: Mulliken charges:
elementType: S O O O C C C C C C C C C C C C C C H H H H H H H H H H H H H H H H H H H H
charge: 0.966086 -0.420290 -0.505175 -0.521730 0.007884 0.016962 -0.424207 -0.425949 -0.445781 -0.431860 -0.740083 -0.028267 -0.239669 -0.242126 -0.359305 -0.361012 0.452332 -0.798165 0.194832 0.238533 0.194876 0.204917 0.205151 0.194672 0.212097 0.216435 0.233675 0.206733 0.215719 0.208525 0.213003 0.279997 0.285005 0.244571 0.245200 0.231023 0.230755 0.244636
chargesum: 0.00000
title: Mulliken charges with hydrogens summed into heavy atoms:
elementType: S O O O C C C C C C C C C C C C C C
charge: 0.966086 -0.420290 -0.505175 -0.521730 0.202716 0.255495 -0.024414 -0.026125 -0.017249 0.008548 -0.102837 -0.028267 0.040328 0.042879 -0.114733 -0.115812 0.452332 -0.091750
polarizability: 2.68331034e+02 1.33770995e+01 1.56132742e+02 9.71614326e+00 -1.30851151e+01 1.53130191e+02
1716.lowfreq: -14.5232 -9.1894 -0.0012 0.0008 0.0022 6.5109 10.4500 20.2865 27.8445
frequency: -6.8664 17.1503 27.8274 31.9987 47.2574 77.9798 119.2887 130.2255 138.0553 193.7328 200.7787 219.2353 223.5167 227.3128 268.2433 291.8075 298.2453 322.4036 371.5324 380.1387 385.2686 407.2411 410.8140 434.6986 461.5700 476.9015 498.3717 538.3281 584.7392 604.7673 621.8971 704.5397 761.0487 778.9484 783.8007 822.8765 827.3928 838.9905 848.3231 884.4151 903.3469 921.1397 949.2944 962.1467 963.1027 972.2897 982.4221 990.3796 994.4191 1012.6956 1026.5324 1049.6335 1055.8870 1060.6431 1090.5357 1104.8885 1119.5177 1151.4991 1177.6946 1185.1077 1219.3963 1219.5593 1242.9525 1247.8578 1293.9843 1296.3072 1297.8183 1299.8344 1314.2502 1335.4062 1338.8075 1348.9156 1363.3901 1382.6650 1387.6677 1393.3844 1398.3634 1457.6471 1461.5472 1469.8956 1471.0163 1473.1620 1474.4228 1475.0016 1476.9008 1478.2496 1595.8540 1596.5617 2945.0958 2961.0244 2964.6548 2968.7026 2970.6021 2980.9622 2990.0436 2994.9809 3026.7291 3033.8127 3053.8301 3060.3143 3063.7468 3064.1353 3066.4594 3093.0968 3137.9373 3139.4645 3164.6079 3167.5225
redmass: 1.0605 2.7848 4.0183 4.6522 4.9466 4.4433 4.6465 4.9852 5.8892 3.5562 1.2852 1.6334 3.1192 7.0276 3.9001 5.1584 2.8186 3.8874 6.1493 5.1661 3.9779 2.8519 2.1063 2.6247 3.2230 4.7031 3.2263 3.7330 4.9298 5.3195 6.9615 3.3210 2.6408 4.9218 1.4585 3.8664 1.6398 2.2516 1.2460 1.6607 3.3161 1.4478 8.8581 1.3292 1.3274 2.8637 1.3980 1.4240 5.4054 1.6694 2.4087 1.5949 2.4559 1.0899 2.3327 2.4841 1.2824 2.2765 1.9685 1.1440 1.9315 1.7910 1.2638 1.3869 1.2755 1.2878 1.2612 1.2377 1.2695 1.5276 1.4672 1.4944 1.5023 6.2806 1.2177 2.9777 1.2194 1.0858 1.0893 1.0828 1.1037 1.0952 2.1997 1.0556 1.0675 1.0806 6.0704 6.9669 1.0806 1.0624 1.0479 1.0649 1.0711 1.0390 1.0616 1.0631 1.0974 1.0977 1.1030 1.0997 1.0947 1.1023 1.0993 1.1001 1.0893 1.0894 1.0955 1.0968
irintensity: 0.4862 1.0252 0.3025 1.2313 0.2379 0.3348 3.3689 1.0147 1.8375 1.7149 0.7527 0.9089 1.3998 9.7337 3.1158 9.6881 0.1327 6.3694 4.0867 11.3367 4.0313 0.0456 6.7565 3.7218 8.6248 85.8358 31.5305 61.2747 3.2832 138.2657 0.1937 0.7249 1.7822 2.7546 0.1967 108.8574 6.5791 16.7581 0.2588 9.9030 38.6733 9.4077 63.2697 4.1991 7.7762 72.7934 0.7184 3.4581 2.1079 17.7050 6.0143 23.7200 26.9191 0.1600 11.8227 7.3547 8.0752 7.0985 14.0110 9.9531 7.8925 2.3101 3.1084 0.4746 1.6728 2.7228 2.1848 0.6654 0.6058 1.1223 0.8657 25.1959 15.9690 0.4262 11.9707 10.3562 16.2834 1.3779 8.7650 10.6979 17.1340 14.0408 22.6594 23.9421 8.1326 4.2310 12.3993 0.2340 6.3733 25.7688 12.8912 33.5563 79.0014 23.0218 11.8534 18.0950 52.8271 28.4649 11.4817 32.6221 17.4525 85.0410 44.4581 14.6993 13.6569 7.1669 0.5666 9.8834
temp: 298.150 k
press: 1.00000 atm
elementType: 16 8 8 8 6 6 6 6 6 6 6 6 6 6 6 6 6 6 1 1 1 1 1 1 1 1 1 1 1 1 1 1 1 1 1 1 1 1
symmnumber: 1
zpe: 817009.8 jmol-1
zpe.correction: 0.311183 hartree
zpe.thermalcorrener: 0.329629 hartree
zpe.thermalcorrenthalpy: 0.330573 hartree
zpe.thermalcorrgfe: 0.262629 hartree
zpe.sumelectzpe: -1167.679841 hartree
zpe.sumelectthermal: -1167.661395 hartree
zpe.sumelectthermalent: -1167.660451 hartree
zpe.sumelectthermalfe: -1167.728395 hartree
dipole: -2.5038 -4.0059 -1.0890
dipole: 4.8479
quadrupole: -83.4566 -123.8175 -116.7084
quadrupole: 5.2044 1.6808 -4.8742
quadrupole: 24.5375 -15.8233 -8.7142 5.2044 1.6808 -4.8742
hfenergy: -1167.9910239 hartree
pointgroup: C01 [X(C14H20O3S1)]
dipole: 0.9803228 1.6299428 -0.1417433 debye
polarizability: 268.193632|15.259252|151.4790468|-7.6295693|12.6886535|157.9212874 unknown
InChI: InChI=1S/C14H20O3S/c1-11-3-7-13(8-4-11)17-18(15,16)14-9-5-12(2)6-10-14/h5-6,9-11,13H,3-4,7-8H2,1-2H3
charge 0 multiplicity 1
38 atoms
S  0.498529 -1.347632 0.104112
O  -0.542255 0.136334 -0.362103
O  0.400733 -2.491204 -1.041419
O  0.157535 -1.713231 1.650431
C  -4.849816 0.546604 -0.418556
C  -1.955422 0.03468 0.101318
C  -3.983291 1.511158 0.431836
C  -4.269245 -0.889221 -0.346597
C  -2.489579 1.478214 0.019087
C  -2.779097 -0.934287 -0.765124
C  -6.328618 0.583045 0.021713
C  2.16524 -0.502151 -0.009355
C  2.655692 0.155453 1.129483
C  2.863696 -0.582538 -1.223684
C  3.9244 0.76691 1.034034
C  4.129303 0.040019 -1.291559
C  4.675971 0.720282 -0.170972
C  6.05108 1.356909 -0.248541
H  -4.789373 0.883039 -1.477002
H  -1.954621 -0.305116 1.159109
H  -4.079364 1.231105 1.502196
H  -4.365376 2.546459 0.337955
H  -4.856861 -1.569486 -0.992807
H  -4.375806 -1.268186 0.692014
H  -2.37646 1.839237 -1.021561
H  -1.885192 2.137185 0.668622
H  -2.382671 -1.962663 -0.672397
H  -2.671272 -0.637961 -1.827003
H  -6.949729 -0.086241 -0.602503
H  -6.432984 0.254276 1.074026
H  -6.747531 1.604005 -0.05519
H  2.075082 0.174132 2.057057
H  2.438423 -1.121635 -2.075958
H  4.33474 1.287791 1.906571
H  4.69775 -0.003727 -2.227401
H  6.289368 1.68576 -1.274737
H  6.132704 2.230912 0.420488
H  6.83432 0.63587 0.055825
