program: Gaussian 09
title: 000241376
version: EM64L-G09RevD.01
frameworkgroup: C1[X(C14H15ClO6)]
method: RPBEPBE
basis: SDD
operation: Freq
keyword: #p
keyword: freq=noraman
keyword: PBEPBE/SDD
title: #p freq=noraman PBEPBE/SDD
converged: YES YES NO NO
title: Mulliken charges:
elementType: Cl O O O O O O C C C C C C C C C C C C C C H H H H H H H H H H H H H H H
charge: -0.045959 -0.293763 -0.249384 -0.248436 -0.241710 -0.267103 -0.277092 0.429490 0.434258 0.019686 -0.485891 -0.487517 -0.345984 -0.346569 -0.133745 0.306609 0.327414 0.327840 -0.757094 -0.754908 -0.753025 0.227947 0.268493 0.228133 0.268998 0.270524 0.270189 0.254898 0.249247 0.284275 0.241166 0.271082 0.247195 0.241148 0.247425 0.272165
chargesum: 0.00000
title: Mulliken charges with hydrogens summed into heavy atoms:
elementType: Cl O O O O O O C C C C C C C C C C C C C C
charge: -0.045959 -0.293763 -0.249384 -0.248436 -0.241710 -0.267103 -0.277092 0.429490 0.434258 0.019686 0.010548 0.009614 -0.075460 -0.076381 -0.133745 0.306609 0.327414 0.327840 0.031326 0.004535 0.007713
polarizability: 2.36285183e+02 -6.72863023e-01 1.75754480e+02 9.21988985e+00 1.99567927e-01 1.32113876e+02
1716.lowfreq: -8.3299 -1.9468 0.0024 0.0027 0.0030 3.6737 28.1588 32.2887 37.8986
frequency: 28.0995 32.1831 37.8974 60.7549 63.3939 65.6602 71.0758 78.6001 91.7951 99.0677 102.4156 119.5412 124.4350 151.8408 161.0117 176.6541 184.8687 235.2166 253.1316 283.7905 292.0526 319.8023 333.5827 354.7574 407.4549 413.9328 448.9307 492.8172 528.2460 530.2520 554.7401 557.9677 567.6367 575.3128 604.8018 612.4936 621.0583 634.0387 696.4178 749.3415 793.4271 799.1142 829.4206 870.2845 890.8620 894.1332 915.0752 917.9373 978.0194 983.7017 997.8499 998.7881 1001.6693 1027.4731 1044.4680 1044.6606 1049.3161 1099.5141 1131.5761 1172.2104 1188.0803 1200.4309 1219.7910 1235.3677 1250.7563 1276.5828 1343.3460 1348.5338 1378.6419 1380.2658 1382.0225 1382.8533 1420.6912 1447.4197 1449.2073 1451.6699 1453.3655 1453.8617 1454.2805 1454.9863 1476.8613 1478.6115 1586.5824 1604.0339 1644.1782 1648.8213 1676.8946 3005.5229 3005.7263 3009.5132 3037.5902 3037.7395 3101.7120 3101.9173 3107.7883 3108.1024 3111.0281 3142.1405 3142.2775 3150.5163 3160.8472 3162.8225
redmass: 4.7112 4.7773 3.8713 4.2862 5.9094 3.8439 1.8007 2.3642 1.0774 1.0592 12.8314 3.8494 6.1094 8.4053 10.7361 5.4745 6.1978 7.1907 4.6707 5.0187 4.7634 2.2837 3.4016 5.6351 3.5061 4.7938 4.0674 3.3338 4.7773 3.8398 3.8865 3.3718 3.9121 4.2220 4.6947 5.0280 4.4435 5.6435 5.2468 6.2608 4.6112 5.9237 5.4622 4.4579 1.9351 1.8903 2.9667 5.4888 3.0734 2.1163 2.0209 1.9305 1.9439 2.4122 1.6490 1.6479 1.6470 2.1396 2.6850 2.9213 2.8921 3.1348 1.2875 1.2819 1.2495 3.2283 1.2673 1.3733 6.0191 1.2326 1.2734 1.2458 4.8547 1.5180 1.6443 1.0542 1.0578 1.0603 1.0606 1.0621 1.1003 1.1090 6.7610 9.0037 9.2995 9.4222 10.7633 1.0384 1.0383 1.0388 1.0569 1.0569 1.0937 1.0937 1.1084 1.1083 1.0935 1.1028 1.1028 1.1023 1.0928 1.0933
irintensity: 0.3785 2.3286 0.0868 1.7624 0.2615 9.0785 0.2531 0.4472 0.4002 0.6071 0.4585 10.4759 2.2274 0.8930 0.2968 5.0553 8.7684 0.3063 0.3527 0.4495 4.9142 16.4060 13.2689 0.2423 0.0559 12.2003 13.0808 4.8821 6.0299 8.7848 4.3226 6.3448 3.5684 2.6732 10.4658 0.0839 12.5758 19.5037 1.7695 3.3329 4.9604 106.3134 56.5962 24.2947 14.1713 34.6787 16.7224 79.9849 38.8594 5.8269 53.2804 6.4497 78.6660 7.0593 2.6763 16.9874 27.0753 15.2236 192.0455 22.1528 86.4067 654.1700 14.9459 97.0540 1.6674 14.0345 0.8803 13.1414 2.7107 82.5876 4.8869 120.8163 1.4228 38.4387 32.4048 21.5230 21.5740 9.3256 15.3904 42.5598 8.0009 32.0261 41.5737 0.0892 29.0296 298.7495 154.8321 1.0960 1.2197 1.1294 7.9677 45.0097 10.3522 7.4443 10.8579 2.5633 2.4564 4.6362 10.5100 4.6028 0.8082 0.1091
temp: 298.150 k
press: 1.00000 atm
elementType: 17 8 8 8 8 8 8 6 6 6 6 6 6 6 6 6 6 6 6 6 6 1 1 1 1 1 1 1 1 1 1 1 1 1 1 1
symmnumber: 1
zpe: 698798.3 jmol-1
zpe.correction: 0.266158 hartree
zpe.thermalcorrener: 0.288771 hartree
zpe.thermalcorrenthalpy: 0.289715 hartree
zpe.thermalcorrgfe: 0.211707 hartree
zpe.sumelectzpe: -1452.350234 hartree
zpe.sumelectthermal: -1452.327621 hartree
zpe.sumelectthermalent: -1452.326677 hartree
zpe.sumelectthermalfe: -1452.404685 hartree
dipole: 0.4188 -0.0424 0.3521
dipole: 0.5488
quadrupole: -134.0280 -118.2725 -125.8850
quadrupole: 0.3407 -8.6700 0.0482
quadrupole: -7.9662 7.7893 0.1768 0.3407 -8.6700 0.0482
hfenergy: -1452.6163921 hartree
pointgroup: C01 [X(C14H15Cl1O6)]
dipole: 0.014682 0.1656838 0.1376667 debye
polarizability: 175.7415047|-0.4148001|236.3695501|-0.7424393|8.749119|132.042484 unknown
InChI: InChI=1S/C14H15ClO6/c1-8(16)19-6-11-4-13(15)5-12(7-20-9(2)17)14(11)21-10(3)18/h4-5H,6-7H2,1-3H3
charge 0 multiplicity 1
36 atoms
Cl -0.00719 5.014101 0.560753
O  -0.016541 -0.716373 -1.321457
O  -3.037545 -0.030368 0.509349
O  3.019568 -0.028306 0.47667
O  -0.004848 -1.693867 0.809542
O  -3.013205 -2.178736 -0.416406
O  3.061232 -2.164993 -0.472772
C  -1.250658 1.262821 -0.576367
C  1.228024 1.265158 -0.593031
C  -0.012044 0.607503 -0.78911
C  -2.56958 0.55702 -0.792136
C  2.545816 0.562001 -0.822074
C  -1.237474 2.6167 -0.162653
C  1.217696 2.619115 -0.179315
C  -0.009149 3.270853 0.032206
C  -0.012529 -1.840179 -0.425887
C  -3.183118 -1.42547 0.569282
C  3.195712 -1.418831 0.524766
C  0.023789 -3.117599 -1.214046
C  -3.520678 -1.854597 1.976164
C  3.519696 -1.857413 1.931864
H  -3.358128 1.270736 -1.079363
H  -2.494229 -0.25519 -1.534518
H  3.331695 1.277252 -1.112886
H  2.467993 -0.248255 -1.566265
H  -2.180757 3.144591 0.007709
H  2.162158 3.14881 -0.021403
H  -0.470256 -2.992551 -2.188133
H  -0.467548 -3.916705 -0.640043
H  1.083933 -3.386073 -1.376782
H  -4.067019 -2.809568 1.956274
H  -2.572474 -2.003412 2.525452
H  -4.102915 -1.082031 2.500951
H  4.087729 -2.799565 1.910188
H  4.075625 -1.07808 2.474849
H  2.566217 -2.033204 2.463728
