program: Gaussian 09
title: 000241372
version: EM64L-G09RevD.01
frameworkgroup: C1[X(C11H12O2)]
method: RPBEPBE
basis: SDD
operation: Freq
keyword: #pfreq=noraman
keyword: PBEPBE/SDD
title: #p freq=noraman PBEPBE/SDD
converged: YES YES NO NO
title: Mulliken charges:
elementType: O O C C C C C C C C C C C H H H H H H H H H H H H
charge: -0.430460 -0.229251 0.035737 0.403634 0.362468 -0.622787 -0.546469 0.327705 -0.807346 -0.826484 0.001035 -0.115874 -0.540354 0.230237 0.259314 0.233805 0.212490 0.267004 0.247420 0.231281 0.239656 0.233480 0.357975 0.222760 0.253023
chargesum: 0.00000
title: Mulliken charges with hydrogens summed into heavy atoms:
elementType: O O C C C C C C C C C C C
charge: -0.072485 -0.229251 0.035737 0.403634 0.362468 -0.392550 -0.287155 0.327705 -0.094048 -0.108127 0.001035 0.117607 -0.064571
polarizability: 1.98972801e+02 -1.08774929e+00 1.31060633e+02 6.57450054e-01 3.20495938e+00 6.89537209e+01
1716.lowfreq: -10.5630 -0.0003 0.0003 0.0007 4.6326 11.9556 51.0627 64.4631 107.7486
frequency: 51.0464 64.4587 107.7474 142.9218 151.6958 180.1872 195.9543 217.4220 245.7464 290.8716 301.0011 312.7442 345.2803 385.8207 420.7930 498.9930 508.3115 524.9135 552.8122 561.9819 583.3625 605.3377 714.8230 726.2855 802.9474 838.2653 874.9090 949.0295 957.8986 978.5216 991.3448 1007.7906 1027.7052 1038.9268 1041.4344 1042.8762 1060.8900 1135.0451 1180.7354 1223.2703 1248.9419 1296.0780 1319.0011 1370.9264 1402.0525 1402.2446 1404.3353 1428.8485 1449.6904 1459.1849 1478.0507 1480.8612 1483.5135 1534.7954 1586.6465 1619.5339 1632.3802 2980.1662 2993.1405 3062.6897 3081.6283 3089.7630 3096.1588 3098.5711 3109.9378 3140.1094 3156.3048 3213.0369 3577.5376
redmass: 4.1823 5.1111 2.7487 1.0642 1.0825 3.2826 3.4182 2.9455 4.5484 4.1485 3.6937 4.0801 3.3039 1.1175 4.8518 2.2767 3.5531 3.0158 4.0709 2.9457 4.9250 3.3638 2.9125 3.0940 4.1587 1.4224 1.4622 3.3819 3.0720 3.8845 1.4123 1.0950 1.7098 1.5873 1.6269 1.5568 1.6824 1.6406 1.3914 2.2691 1.7205 1.5248 5.4367 6.0822 1.2515 1.2288 1.2149 2.1474 1.9791 1.1114 1.2431 1.0793 1.4378 8.4847 6.9652 5.7584 4.6975 1.0409 1.0366 1.0934 1.0970 1.1004 1.0589 1.0990 1.0914 1.0942 1.0923 1.1157 1.0660
irintensity: 1.5654 6.1038 1.6541 0.5083 0.2569 5.4277 4.3903 2.5599 2.5249 0.1318 10.1157 1.6853 2.3986 143.0686 3.0225 9.2955 1.5426 5.2145 0.7476 0.8903 17.6560 11.9334 5.4889 8.6624 9.1585 18.0310 23.9285 15.5661 16.3406 41.8139 37.4928 39.9759 20.1424 7.0677 13.1071 7.5950 0.8506 316.2984 21.6793 70.2475 4.6244 7.1130 100.8146 6.8303 57.2389 33.9203 26.6621 10.6860 67.3795 11.4353 26.7852 14.3861 12.8147 105.9523 92.0626 241.2593 9.1663 23.4208 23.0126 19.7072 13.1451 17.7165 9.2478 13.5446 23.2279 9.9715 5.5048 7.7875 54.4256
temp: 298.150 k
press: 1.00000 atm
elementType: 8 8 6 6 6 6 6 6 6 6 6 6 6 1 1 1 1 1 1 1 1 1 1 1 1
symmnumber: 1
zpe: 520604.2 jmol-1
zpe.correction: 0.198288 hartree
zpe.thermalcorrener: 0.211482 hartree
zpe.thermalcorrenthalpy: 0.212426 hartree
zpe.thermalcorrgfe: 0.159026 hartree
zpe.sumelectzpe: -575.843941 hartree
zpe.sumelectthermal: -575.830747 hartree
zpe.sumelectthermalent: -575.829803 hartree
zpe.sumelectthermalfe: -575.883203 hartree
dipole: -1.1601 -0.5687 -1.7859
dipole: 2.2043
quadrupole: -69.2979 -71.5410 -80.5577
quadrupole: -13.2686 -3.6662 -2.1998
quadrupole: 4.5009 2.2579 -6.7588 -13.2686 -3.6662 -2.1998
hfenergy: -576.0422287 hartree
pointgroup: C01 [X(C11H12O2)]
dipole: 0.4669877 -0.0631661 0.7280188 debye
dipolederiv: -1.7210304 0.0310436 -0.0892321 0.0510623 -0.0972728 -0.034642 -0.1244685 -0.0360521 -0.4279763 -0.837577 0.0720472 -0.1064694 0.2388794 -0.5141547 0.2551897 -0.0366073 0.2277158 -0.6190435 -0.9562193 -0.0126219 -0.0456563 0.0159478 -0.3511707 0.0580705 0.0823733 0.0523429 -0.1425204 0.4539836 -0.0654415 0.037718 0.1327388 0.3775099 -0.0538064 -0.1387697 -0.0728709 0.0316635 0.5105883 0.0603347 0.0188645 -0.1513616 0.3489262 -0.0253703 0.1892754 -0.0627209 -0.0085465 -0.5241291 0.1647517 -0.0301786 0.4054135 -0.1861554 0.0193451 -0.0576557 0.0157965 -0.2461559 -0.5896205 -0.1379822 -0.0076355 -0.3915846 -0.1320564 -0.0318991 0.016039 -0.0126282 -0.2035311 1.6627812 0.0097352 0.1100476 0.0174311 0.3129287 -0.0156849 0.1429084 -0.0091047 0.134325 0.0318348 0.1797053 -0.0154895 0.0985974 -0.0972928 0.0530291 -0.0225568 0.1020139 0.0031752 -0.0169773 -0.0800016 -0.0091984 -0.043566 -0.1383655 0.0052478 0.0167966 0.0647325 0.0622761 1.8185307 0.0422362 -0.0639616 -0.007034 0.4012972 -0.3748211 -0.2819416 -0.3409781 0.6305916 -0.5664167 -0.2045877 0.2646814 -0.203926 -0.1397441 -0.0335854 0.1243812 -0.0314546 -0.0992031 0.0748271 0.0444829 -0.058058 -0.0567059 -0.1757898 -0.169608 0.0916829 -0.1596541 -0.0337192 -0.0345946 -0.0896526 -0.0035079 -0.1114546 -0.0486074 0.0136908 0.0048036 0.0063304 0.1694441 0.0596245 0.0521904 -0.0143442 0.0749603 -0.0370788 0.0186262 -0.0376246 0.0014543 0.1626186 -0.0241976 0.0532766 0.1036976 0.0115744 0.0572201 0.0107763 0.0982952 -0.0310116 0.0184772 -0.0471434 -0.1857169 -0.0251178 -0.0709514 -0.0659819 -0.0161037 -0.0268659 -0.0569367 0.1020439 0.1014844 0.0371588 -0.0633223 0.0164506 0.0607202 -0.0050925 -0.0444716 0.0362292 -0.0388614 -0.040795 -0.0390092 -0.0867949 0.0010511 0.0710625 0.037645 -0.1167517 -0.002584 0.0461245 0.076105 -0.0806701 0.0570188 -0.053119 0.0344991 0.0253256 0.0824365 0.0754619 -0.0948532 -0.0242076 0.1346157 0.0651579 0.0468649 -0.0355456 -0.0507434 0.0395696 -0.0778495 0.0833851 0.0336618 0.0490258 -0.0804345 0.0035152 0.071387 0.1067548 -0.0428844 0.1056409 0.0070453 0.4395545 -0.0068209 0.000862 -0.0275357 0.057759 0.031891 0.0130836 0.0359527 0.37851 0.013779 -0.0428276 0.0651367 -0.0481992 0.103968 0.0908312 0.0992541 0.0867599 0.0326157 0.1061535 0.0147281 -0.0237835 0.0509513 0.1219378 0.0849338 -0.0703016 0.0834144 0.0521147 unknown
polarizability: 198.7459515|4.1170367|127.7280739|-0.2126204|-14.8137888|72.5131299 unknown
InChI: InChI=1S/C11H12O2/c1-4-10(13)11-7(2)5-9(12)6-8(11)3/h4-6,12H,1H2,2-3H3
charge 0 multiplicity 1
25 atoms
O  3.946931 -0.115392 0.296229
O  -2.298859 1.012483 -1.068621
C  -0.26286 0.154394 -0.072296
C  0.522801 1.353778 -0.162491
C  0.388575 -1.113217 0.098863
C  1.92571 1.270957 -0.021599
C  1.795026 -1.163945 0.205939
C  2.557162 0.020245 0.163152
C  -0.096775 2.723793 -0.383347
C  -0.359183 -2.441623 0.109862
C  -1.757724 0.260448 -0.195262
C  -2.608937 -0.477572 0.799914
C  -3.967255 -0.430519 0.749719
H  2.524078 2.190741 -0.064329
H  2.314652 -2.121448 0.311029
H  -0.973383 2.893867 0.266003
H  0.641899 3.520465 -0.188575
H  -0.464367 2.824304 -1.418812
H  -1.28781 -2.412599 -0.48291
H  -0.631587 -2.748318 1.138174
H  0.281288 -3.239167 -0.304699
H  -2.095406 -1.018491 1.603326
H  4.39644 0.764196 0.23582
H  -4.592445 -0.932599 1.49577
H  -4.463569 0.126718 -0.05416
