program: Gaussian 09
title: 000241329
version: EM64L-G09RevD.01
frameworkgroup: C1[X(C18H17NO4)]
method: RPBEPBE
basis: SDD
operation: Freq
keyword: #p
keyword: freq=noraman
keyword: PBEPBE/SDD
title: #p freq=noraman PBEPBE/SDD
converged: YES YES NO NO
title: Mulliken charges:
elementType: O O O O N C C C C C C C C C C C C C C C C C C H H H H H H H H H H H H H H H H H
charge: -0.303859 -0.122338 -0.249168 -0.185184 -0.499007 0.366742 0.323035 -0.717426 -0.374625 -0.358234 -0.255817 -0.237912 0.112906 0.108675 0.233069 0.174933 -0.355836 -0.359393 -0.224942 -0.245506 -0.236525 -0.246018 -0.664343 0.266668 0.272409 0.229422 0.303306 0.361340 0.230040 0.229852 0.270397 0.249767 0.234117 0.236610 0.235288 0.238850 0.251623 0.228573 0.249000 0.229513
chargesum: 0.00000
title: Mulliken charges with hydrogens summed into heavy atoms:
elementType: O O O O N C C C C C C C C C C C C C C C C C C
charge: -0.303859 -0.122338 -0.249168 -0.185184 -0.137666 0.366742 0.323035 -0.178349 -0.145203 -0.054928 -0.025776 -0.008060 0.112906 0.108675 0.233069 0.174933 -0.085439 -0.109626 0.009175 -0.008896 -0.001237 0.244454 0.042743
polarizability: 3.08986952e+02 1.76933738e+00 2.14412019e+02 3.61131824e+00 -1.79843277e+01 1.33842003e+02
1716.lowfreq: -7.1467 -4.6683 -0.0010 -0.0007 -0.0005 2.7485 10.3920 17.7221 25.1027
frequency: 8.1709 17.5984 25.0629 40.6764 50.0285 68.8990 75.7870 79.2502 95.0774 97.3125 154.4659 156.6018 178.3349 206.4842 236.3477 252.5764 265.8840 295.4931 311.9452 314.6817 333.2766 394.1458 404.3573 416.5362 442.8022 453.7354 489.1227 520.0276 540.2737 557.2548 589.1767 613.9083 658.9554 669.0761 688.0235 703.8597 705.7970 708.3374 734.2522 763.6867 769.3375 789.7512 808.7354 815.5928 827.8911 847.4147 861.4926 864.5415 887.3736 925.3092 939.8848 953.8064 986.1257 989.5285 990.5292 993.2879 1004.2053 1006.1483 1023.3275 1050.3204 1072.5863 1085.2441 1094.9638 1112.0429 1129.2143 1156.4831 1173.8428 1176.2374 1181.3906 1188.9980 1200.4394 1248.8727 1274.1016 1275.2694 1301.9847 1305.3545 1318.8808 1351.4613 1377.9020 1382.4207 1393.3232 1432.2373 1439.8802 1449.2241 1461.6646 1463.6384 1471.6974 1481.4676 1482.5732 1515.8010 1578.8635 1594.0574 1608.6116 1612.8499 1616.7918 1638.3792 1644.0177 2987.0268 2995.5188 3036.2866 3058.9597 3090.8939 3099.7605 3125.8956 3126.2314 3129.8463 3135.8847 3140.4103 3146.9809 3157.2955 3164.2096 3169.4987 3200.3679 3456.1272
redmass: 5.3979 4.8849 5.6445 5.3690 4.6515 4.0142 4.2009 5.1870 4.7320 6.1115 4.0075 4.8194 3.8772 1.6795 4.0053 3.3466 6.5519 2.9340 4.1401 5.7201 10.7357 4.7654 2.8280 2.9152 3.6606 3.5758 5.0395 3.9097 3.5552 5.3418 6.0708 6.4303 5.9332 5.5994 2.9337 2.7889 1.9318 1.6276 2.8462 1.8433 2.2622 2.3671 1.6427 3.9359 2.8109 3.5968 1.6217 2.1579 2.0432 2.1850 1.4588 1.4132 1.5212 4.5504 1.3675 2.5254 1.3512 3.9508 2.5777 2.2690 2.7007 1.7234 2.2016 2.3679 3.3549 1.6514 1.0561 1.1331 1.3333 1.1160 1.8176 3.5158 1.1654 2.0060 1.6735 1.5363 1.3210 1.2603 5.8683 9.0280 1.2280 2.2149 2.4059 1.2367 1.0830 1.0506 1.9153 2.2366 1.0712 2.2814 6.2294 6.5088 5.9984 5.1255 4.0343 10.4423 10.7682 1.0630 1.0361 1.0611 1.0959 1.0974 1.1019 1.0853 1.0876 1.1067 1.0881 1.0904 1.0930 1.0960 1.0987 1.1008 1.0945 1.0783
irintensity: 3.7595 0.6180 0.3610 1.0151 1.2639 0.1898 0.5827 0.3398 1.2681 3.2275 0.5671 1.0114 0.7862 1.5558 2.0327 2.0647 7.9179 8.2664 0.2526 2.8923 5.7772 3.3413 0.1046 0.5533 7.4608 13.6373 1.0202 3.1278 2.4817 11.0022 12.4967 0.4670 18.3295 13.1981 9.0798 15.5566 47.1618 87.0512 4.6609 64.7914 34.2001 17.0845 2.6882 9.3733 3.5949 3.0952 0.1400 12.1873 5.1904 5.8510 3.7241 3.1987 5.2954 0.0256 1.1843 5.8308 0.1817 193.1382 11.9608 30.8812 8.7068 18.5397 9.0858 58.5984 78.5091 2.7435 0.3818 4.4991 18.1285 9.5972 4.9592 46.6791 15.5808 86.5183 115.1398 48.6386 0.8134 1.4106 74.7214 3.3469 23.7160 9.5063 114.2280 22.6753 7.2753 13.9229 12.0060 15.8261 19.3835 319.9857 44.9761 51.0894 10.1533 55.6198 9.7564 69.3321 207.5465 9.3187 12.8613 12.8825 4.9565 22.9742 5.8523 2.0922 5.1046 12.6646 3.6603 16.1079 22.5156 15.7212 30.4401 18.6694 5.2974 114.4496
temp: 298.150 k
press: 1.00000 atm
elementType: 8 8 8 8 7 6 6 6 6 6 6 6 6 6 6 6 6 6 6 6 6 6 6 1 1 1 1 1 1 1 1 1 1 1 1 1 1 1 1 1
symmnumber: 1
zpe: 814452.6 jmol-1
zpe.correction: 0.310209 hartree
zpe.thermalcorrener: 0.331723 hartree
zpe.thermalcorrenthalpy: 0.332667 hartree
zpe.thermalcorrgfe: 0.255354 hartree
zpe.sumelectzpe: -1050.126349 hartree
zpe.sumelectthermal: -1050.104835 hartree
zpe.sumelectthermalent: -1050.103890 hartree
zpe.sumelectthermalfe: -1050.181203 hartree
dipole: 3.5037 1.9462 2.9183
dipole: 4.9578
quadrupole: -108.9779 -150.8165 -137.8867
quadrupole: 3.8363 -3.3737 11.7398
quadrupole: 23.5825 -18.2561 -5.3264 3.8363 -3.3737 11.7398
hfenergy: -1050.4365574 hartree
pointgroup: C01 [X(C18H17N1O4)]
dipole: 0.8672523 -1.3232833 -1.1408184 debye
polarizability: 284.9385867|-40.8576957|239.8980479|-6.2102214|-13.2387946|132.4043381 unknown
InChI: InChI=1S/C18H17NO4/c1-2-23-18(22)16(20)12-14-10-6-7-11-15(14)19-17(21)13-8-4-3-5-9-13/h3-11,19H,2,12H2,1H3
charge 0 multiplicity 1
40 atoms
O  -0.220264 -2.276364 -0.357021
O  -2.928945 -1.211565 1.480285
O  1.687707 2.687277 -0.332581
O  -1.749486 -3.806286 0.54986
N  0.080607 0.973297 -0.119057
C  -2.361242 1.054683 -0.458202
C  -1.130443 1.72848 -0.175324
C  -2.395166 -0.427957 -0.799692
C  -3.565828 1.793405 -0.441949
C  -1.140238 3.128393 0.071699
C  -3.578899 3.178866 -0.175922
C  -2.35619 3.840312 0.072581
C  -2.311319 -1.379223 0.406842
C  1.389492 1.474143 -0.107232
C  2.461266 0.459337 0.202295
C  -1.438585 -2.647247 0.219276
C  3.735321 0.634676 -0.396219
C  2.269525 -0.589207 1.139498
C  4.79327 -0.24596 -0.090169
C  3.335659 -1.460601 1.458038
C  4.596042 -1.297531 0.837629
C  0.776897 -3.377374 -0.62102
C  0.50374 -4.020512 -1.980734
H  -3.369661 -0.655956 -1.277309
H  -1.617105 -0.701482 -1.533617
H  -4.507261 1.269516 -0.644978
H  -0.19463 3.643319 0.244405
H  0.002187 -0.05051 -0.125031
H  -4.524316 3.730832 -0.170963
H  -2.34224 4.917898 0.269348
H  3.878281 1.475328 -1.0830
H  1.307585 -0.702235 1.652344
H  5.771999 -0.108268 -0.562399
H  3.188237 -2.251434 2.202083
H  5.422262 -1.972326 1.087694
H  0.697939 -4.108664 0.202313
H  1.745306 -2.856989 -0.580129
H  1.28819 -4.770227 -2.193053
H  -0.471465 -4.535521 -1.990455
H  0.52457 -3.267823 -2.787335
