program: Gaussian 09
title: 000241322
version: EM64L-G09RevD.01
frameworkgroup: C1[X(C15H12Cl2N4O)]
method: RPBEPBE
basis: SDD
operation: Freq
keyword: #p
keyword: freq=noraman
keyword: PBEPBE/SDD
title: #p freq=noraman PBEPBE/SDD
converged: YES YES NO NO
title: Mulliken charges:
elementType: Cl Cl O N N N N C C C C C C C C C C C C C C C H H H H H H H H H H H H
charge: -0.051372 -0.051372 -0.196944 0.059740 0.059739 -0.421721 -0.421721 0.468022 0.468021 -0.375770 -0.375771 -0.354213 -0.354213 -0.210601 -0.210601 -0.205361 -0.205361 -0.100787 -0.100786 -0.382666 -0.382666 0.354152 0.227811 0.227811 0.287958 0.287958 0.256964 0.256964 0.259192 0.259192 0.204742 0.204743 0.259458 0.259458
chargesum: 0.00000
title: Mulliken charges with hydrogens summed into heavy atoms:
elementType: Cl Cl O N N N N C C C C C C C C C C C C C C C
charge: -0.051372 -0.051372 -0.196944 0.059740 0.059739 -0.162263 -0.162264 0.468022 0.468021 -0.147959 -0.147959 -0.066255 -0.066254 0.046363 0.046363 0.053831 0.053831 -0.100787 -0.100786 -0.177924 -0.177923 0.354152
polarizability: 6.06708340e+02 -2.06825876e-05 2.04885933e+02 -1.31760602e-02 2.78309204e-02 7.84067775e+01
1716.lowfreq: -14.2852 -3.6109 -3.4076 -0.0024 -0.0024 -0.0022 1.9286 17.0320 18.4752
frequency: -14.2783 16.9880 18.4752 44.8783 58.1822 60.1903 86.8487 111.3743 116.9953 166.3560 171.2123 192.6996 208.4644 215.2880 245.6148 275.6183 282.4027 296.7507 358.1518 360.0726 387.3560 408.4210 411.8019 411.9307 426.7925 489.5087 500.3125 513.1225 526.2595 578.5315 609.6706 622.9000 624.5512 666.9985 689.9383 690.8320 717.4817 717.8941 750.3152 821.8102 822.0026 838.2740 846.2431 846.4835 875.5063 925.7280 927.0426 957.6458 957.9663 989.1275 989.2096 997.1431 997.4342 1005.9685 1027.7373 1070.2681 1070.5362 1108.4152 1111.5662 1136.8380 1153.0421 1181.7370 1181.7611 1237.4475 1240.4168 1295.0938 1295.2717 1334.8730 1335.3494 1378.9152 1379.9635 1401.7817 1401.8882 1474.4737 1475.3505 1506.6654 1517.5319 1564.8238 1566.6879 1592.2095 1596.0087 1600.1245 1600.6868 1695.6938 2962.6364 2962.9376 3126.8114 3126.8218 3157.2751 3157.2826 3172.7726 3172.7822 3177.1366 3177.1590 3342.9658 3353.6117
redmass: 3.9466 9.0134 11.4062 6.5131 8.9443 6.6510 7.0968 4.3451 9.6787 3.3651 9.4253 5.2059 10.1727 5.2600 3.6800 11.6566 6.1326 6.1983 4.1220 5.0400 10.0212 7.5412 2.9474 2.9527 5.7101 7.4497 1.7280 2.7517 2.1853 7.4385 1.2942 7.1742 7.1879 6.8491 6.7236 7.7060 3.5660 3.5876 6.8386 1.3399 1.3398 4.9112 1.3598 1.3618 4.2183 1.4623 1.4566 1.4306 1.4336 1.3543 1.3544 4.1081 4.1786 5.6338 8.1093 2.7446 2.7984 1.4241 1.3659 2.9681 4.8513 1.1175 1.1156 1.9020 1.8415 1.3183 1.3167 1.9504 1.8693 3.3686 3.4332 3.7230 3.6797 2.2455 2.2692 1.9363 1.6574 7.9833 7.8530 6.1466 5.9720 6.2798 6.2851 8.6666 1.0868 1.0868 1.0899 1.0899 1.0888 1.0888 1.0952 1.0952 1.0975 1.0975 1.0750 1.0742
irintensity: 0.0000 1.5755 0.1177 0.0000 5.2772 8.0823 5.2961 0.0000 0.1831 0.0002 0.4956 1.0650 10.2812 0.0001 49.2434 22.3543 0.4169 0.0386 0.0000 4.9926 2.0298 5.8528 0.0062 0.0000 1.6954 32.9147 0.0000 39.7884 0.0002 4.1021 201.1780 0.0289 0.3776 7.5302 0.1579 1.4805 0.0000 7.8011 50.0013 0.0001 47.5538 7.5946 0.0004 59.8678 0.1516 0.0002 71.6422 0.0001 21.5956 0.0002 3.7645 104.8341 6.7442 0.0981 14.7344 174.4487 12.0306 23.0241 2.3884 2067.4863 6.6000 0.4887 0.0705 78.4608 2.6667 1.0006 4.9809 0.0302 21.0047 0.1102 0.8353 16.9827 0.0144 395.0458 5.6650 613.8010 10.0946 1.6661 11.7497 1.7425 2.3264 106.5527 8.5796 168.5820 32.3249 97.9827 2.6972 21.2864 0.4891 0.2947 4.2451 8.0013 5.6901 0.6634 46.9301 4.8744
temp: 298.150 k
press: 1.00000 atm
elementType: 17 17 8 7 7 7 7 6 6 6 6 6 6 6 6 6 6 6 6 6 6 6 1 1 1 1 1 1 1 1 1 1 1 1
symmnumber: 1
zpe: 635528.8 jmol-1
zpe.correction: 0.242060 hartree
zpe.thermalcorrener: 0.261549 hartree
zpe.thermalcorrenthalpy: 0.262493 hartree
zpe.thermalcorrgfe: 0.190875 hartree
zpe.sumelectzpe: -1791.543029 hartree
zpe.sumelectthermal: -1791.523540 hartree
zpe.sumelectthermalent: -1791.522596 hartree
zpe.sumelectthermalfe: -1791.594214 hartree
dipole: 0.0000 7.9103 0.0054
dipole: 7.9103
quadrupole: -169.1912 -119.9073 -147.6148
quadrupole: 0.0001 -0.0241 0.0035
quadrupole: -23.6201 25.6638 -2.0437 0.0001 -0.0241 0.0035
hfenergy: -1791.7850895 hartree
pointgroup: C01 [X(C15H12Cl2N4O1)]
dipole: -0.0000129 -3.1120771 -0.0190923 debye
polarizability: 606.7083297|-0.0036186|204.8804317|0.0732063|0.8345918|78.4122886 unknown
InChI: InChI=1S/C15H12Cl2N4O/c16-13-5-1-11(2-6-13)9-18-20-15(22)21-19-10-12-3-7-14(17)8-4-12/h1-10,20-21H
charge 0 multiplicity 1
34 atoms
Cl 9.122972 1.254493 0.011185
Cl -9.12291 1.254643 0.010721
O  0.000026 1.207045 0.00778
N  2.402189 -0.255621 -0.000318
N  -2.402156 -0.255583 -0.001232
N  1.163353 -0.854004 -0.003796
N  -1.163329 -0.853979 -0.00542
C  4.814936 -0.465351 -0.000283
C  -4.814905 -0.465265 -0.002883
C  5.940549 -1.333867 -0.004563
C  -5.940535 -1.333744 -0.009685
C  5.030231 0.943538 0.00756
C  -5.030175 0.943608 0.008124
C  7.254285 -0.819067 -0.001149
C  -7.254262 -0.818923 -0.005652
C  6.335301 1.468853 0.01106
C  -6.335234 1.468942 0.012281
C  7.43093 0.577702 0.006654
C  -7.43088 0.577827 0.005335
C  3.463439 -1.035981 -0.003869
C  -3.463418 -1.035913 -0.007147
C  0.000018 -0.037451 0.000272
H  5.792735 -2.420768 -0.010576
H  -5.792741 -2.420631 -0.018155
H  4.161344 1.608905 0.010852
H  -4.161275 1.608946 0.013325
H  8.119825 -1.487284 -0.004446
H  -8.119814 -1.487112 -0.010888
H  6.503066 2.549649 0.017115
H  -6.50298 2.549725 0.020768
H  3.388823 -2.14366 -0.009519
H  -3.38882 -2.143576 -0.0154
H  1.079388 -1.883268 -0.008747
H  -1.079377 -1.88323 -0.012804
