program: Gaussian 09
title: 000241997
version: EM64L-G09RevD.01
frameworkgroup: C1[X(C15H16N2O3)]
method: RPBEPBE
basis: SDD
operation: Freq
keyword: #p
keyword: freq=noraman
keyword: PBEPBE/SDD
title: #p freq=noraman PBEPBE/SDD
converged: YES YES NO NO
title: Mulliken charges:
elementType: O O O N N C C C C C C C C C C C C C C C H H H H H H H H H H H H H H H H
charge: -0.294061 -0.249830 -0.434889 -0.015840 -0.059878 0.280279 0.167443 0.156478 -0.115672 -0.421419 -0.496745 -0.360598 -0.324787 0.193262 -0.677350 -0.248676 -0.225995 -0.377917 0.209412 -0.753335 0.275553 0.235423 0.207345 0.298358 0.264949 0.216755 0.222138 0.236496 0.231205 0.233339 0.228336 0.273692 0.243655 0.237289 0.271413 0.374171
chargesum: 0.00000
title: Mulliken charges with hydrogens summed into heavy atoms:
elementType: O O O N N C C C C C C C C C C C C C C C
charge: -0.294061 -0.249830 -0.060717 -0.015840 -0.059878 0.280279 0.167443 0.156478 -0.115672 -0.145865 -0.053977 -0.062240 -0.059839 0.193262 -0.001961 -0.017472 0.007345 0.124111 0.209412 -0.000977
polarizability: 2.40166844e+02 -1.18694660e+01 2.42037408e+02 -1.14948413e+01 -1.60066119e+00 1.13149240e+02
1716.lowfreq: -10.7440 -2.0491 -0.0005 -0.0004 0.0005 4.7687 7.9881 26.3270 32.3467
frequency: -4.8567 26.3125 32.3113 35.2242 41.9625 63.0091 79.9807 104.5320 130.6603 178.9507 190.5656 200.4131 229.5778 237.1499 275.8218 288.5113 302.5828 340.1871 352.9686 376.7234 393.7092 418.1267 456.9766 465.1697 488.5697 518.2300 519.6975 552.8735 572.0475 625.2158 625.6535 686.7827 704.6317 730.2894 749.2709 781.3340 786.8866 798.0024 807.9866 821.3059 864.5226 888.3445 895.1218 924.3653 939.2179 953.8954 969.6528 983.1976 998.4432 1007.3813 1023.3913 1027.6201 1055.7662 1056.1987 1066.6252 1100.8315 1137.3910 1177.6019 1195.4085 1221.3791 1238.8891 1249.3738 1255.6540 1277.9791 1306.8085 1311.9228 1331.3764 1350.3694 1355.6403 1377.0716 1383.4649 1387.9817 1413.5111 1447.8774 1454.4514 1459.3334 1465.0142 1467.1195 1473.6137 1485.9583 1502.5083 1544.0032 1578.1602 1618.7451 1620.8040 1627.9462 2982.2215 2984.8518 2998.8921 3026.8556 3062.9456 3072.7876 3083.1822 3092.3877 3110.4612 3123.4187 3133.2523 3150.6800 3170.4494 3180.5323 3188.1019 3566.8279
redmass: 4.4459 6.8799 3.9394 3.1771 2.7515 1.2635 3.8798 4.7435 3.8920 4.4194 4.8814 1.4433 5.2894 3.3996 5.3493 3.1161 2.6118 4.4703 3.1027 3.3486 2.5712 3.4445 2.0468 4.3513 4.3802 3.9368 3.0717 4.2550 5.4818 4.3618 5.4350 4.0013 4.2233 5.2732 4.9411 1.4342 1.4799 3.4231 4.2133 3.4834 6.7498 4.4373 1.5404 3.7569 1.4906 1.7244 6.2236 1.3542 2.8512 1.3169 1.5991 2.1158 1.8490 1.8872 1.6925 2.8085 1.8416 1.2911 1.4666 1.2692 1.3777 1.8546 1.7137 2.0839 1.7632 1.4618 2.8640 1.6950 2.9362 4.1077 1.2451 1.2550 2.7743 1.0865 2.8812 1.0748 1.0939 1.0595 1.0459 1.0944 3.8289 7.4668 7.4739 6.1676 7.1027 8.4417 1.0348 1.0407 1.0624 1.0582 1.0992 1.0920 1.0997 1.1019 1.1060 1.1000 1.0866 1.0915 1.0978 1.0919 1.0953 1.0674
irintensity: 0.0728 0.3073 0.0248 0.2397 0.4883 0.8503 1.5798 0.3856 0.3852 3.5780 1.1779 0.3480 2.6214 1.1887 10.8100 6.4985 1.2553 1.7143 5.8702 18.1362 18.4693 11.0054 124.0016 4.2347 4.7884 15.9947 11.5465 1.8248 13.7922 25.1048 11.8505 1.6161 6.6346 0.9930 6.5646 2.6954 92.5831 1.8703 20.5411 4.0308 96.0575 114.1939 0.0451 10.5734 12.5535 0.7505 187.1413 4.2570 1.5938 0.5749 60.5589 6.6461 40.9935 48.5481 16.8931 175.3411 188.8394 48.2594 51.8762 19.8194 5.6938 50.9236 21.5389 12.5604 1.8995 27.4608 32.0399 18.4260 3.7058 8.3167 47.9896 12.1500 2.7791 28.1785 3.4597 12.4302 4.5712 18.7617 13.2541 9.2710 46.2115 43.7541 73.5033 5.0036 38.9221 44.7644 37.1157 9.5433 27.8140 31.4403 1.5377 12.6918 57.5749 32.7507 2.0855 4.2629 7.1412 16.6701 16.6074 1.1529 16.1281 55.5606
temp: 298.150 k
press: 1.00000 atm
elementType: 8 8 8 7 7 6 6 6 6 6 6 6 6 6 6 6 6 6 6 6 1 1 1 1 1 1 1 1 1 1 1 1 1 1 1 1
symmnumber: 1
zpe: 738036.0 jmol-1
zpe.correction: 0.281103 hartree
zpe.thermalcorrener: 0.299672 hartree
zpe.thermalcorrenthalpy: 0.300616 hartree
zpe.thermalcorrgfe: 0.232134 hartree
zpe.sumelectzpe: -914.882374 hartree
zpe.sumelectthermal: -914.863805 hartree
zpe.sumelectthermalent: -914.862861 hartree
zpe.sumelectthermalfe: -914.931343 hartree
dipole: -1.3236 1.4711 0.1097
dipole: 1.9819
quadrupole: -108.3055 -105.2986 -118.2848
quadrupole: -6.0026 0.1147 4.3942
quadrupole: 2.3241 5.3310 -7.6552 -6.0026 0.1147 4.3942
hfenergy: -915.1634774 hartree
pointgroup: C01 [X(C15H16N2O3)]
dipole: 0.4986239 0.5292618 -0.2815332 debye
polarizability: 240.1910738|11.546292|213.7239459|-3.0273569|-54.5740033|141.4384718 unknown
InChI: InChI=1S/C15H16N2O3/c1-3-11-8-13(15(18)20-9-10(2)17-19)12-6-4-5-7-14(12)16-11/h4-8,19H,3,9H2,1-2H3
charge 0 multiplicity 1
36 atoms
O  1.932888 0.042886 -0.862866
O  1.428673 -2.070182 -0.01702
O  5.560414 0.393368 1.957412
N  -2.994104 0.733778 -0.240296
N  4.794629 -0.382972 0.975944
C  -1.448969 -1.174758 0.256285
C  -0.356871 -0.395065 -0.292571
C  -1.953493 1.430186 -0.74715
C  -2.75979 -0.542599 0.255022
C  -0.626657 0.890937 -0.783191
C  -2.244846 2.802132 -1.32559
C  -1.332281 -2.497818 0.798414
C  -3.887819 -1.245908 0.787555
C  1.044721 -0.924507 -0.350964
C  -2.497623 2.737405 -2.856266
C  -2.454364 -3.156596 1.309972
C  -3.740783 -2.532657 1.306777
C  3.379781 -0.336255 -0.926916
C  4.148294 0.408094 0.145073
C  4.13434 1.91608 0.158561
H  0.187412 1.488219 -1.199373
H  -3.140652 3.206773 -0.823647
H  -1.399078 3.485979 -1.120877
H  -0.353862 -2.981903 0.802058
H  -4.853175 -0.731419 0.766558
H  -1.616249 2.340683 -3.393126
H  -2.71895 3.742956 -3.25704
H  -3.356772 2.079508 -3.076281
H  -2.345572 -4.167008 1.719523
H  -4.606902 -3.066808 1.712379
H  3.695488 -0.019539 -1.936162
H  3.486555 -1.425737 -0.800063
H  3.13129 2.283678 -0.117376
H  4.857087 2.315285 -0.579981
H  4.416842 2.304826 1.148944
H  5.948795 -0.320545 2.525877
