program: Gaussian 09
title: 000241318
version: EM64L-G09RevD.01
frameworkgroup: C1[X(C17H18N4O3)]
method: RPBEPBE
basis: SDD
operation: Freq
keyword: #p
keyword: freq=noraman
keyword: PBEPBE/SDD
title: #p freq=noraman PBEPBE/SDD
converged: YES YES NO NO
title: Mulliken charges:
elementType: O O O N N N N C C C C C C C C C C C C C C C C C H H H H H H H H H H H H H H H H H H
charge: -0.292713 -0.292710 -0.204713 0.051305 0.051191 -0.420048 -0.420208 0.287675 0.287545 0.216837 0.216687 -0.348078 -0.347952 -0.350301 -0.350348 -0.246319 -0.246437 -0.231313 -0.231254 -0.377455 -0.377409 -0.535050 -0.534947 0.343920 0.285476 0.285610 0.238534 0.238485 0.230890 0.230904 0.226036 0.226025 0.243577 0.243542 0.224734 0.224124 0.242180 0.242161 0.224567 0.224240 0.260484 0.260526
chargesum: 0.00000
title: Mulliken charges with hydrogens summed into heavy atoms:
elementType: O O O N N N N C C C C C C C C C C C C C C C C C
charge: -0.292713 -0.292710 -0.204713 0.051305 0.051191 -0.159564 -0.159682 0.287675 0.287545 0.216837 0.216687 -0.062602 -0.062343 -0.111768 -0.111864 -0.015429 -0.015533 -0.005277 -0.005229 -0.133878 -0.133867 0.155988 0.156021 0.343920
polarizability: 5.56513503e+02 -8.47062277e-02 2.52292336e+02 -4.69718612e+00 -3.46580229e-01 9.95429552e+01
1716.lowfreq: -4.1784 -0.0013 -0.0010 0.0011 1.9474 6.1499 10.9567 19.7262 22.7324
frequency: 10.9542 19.7056 22.7257 53.4414 57.6031 62.6357 99.8787 100.8566 115.7896 130.3845 132.0698 150.7991 163.4789 186.3370 197.4395 212.9528 227.7420 262.5158 263.3616 267.1422 271.0660 321.4175 329.1525 330.0752 378.5879 386.8958 474.0766 479.4650 481.0518 488.8564 510.9931 515.2632 544.6161 548.5660 565.5834 576.3892 598.8975 618.3920 652.6638 686.0689 740.2560 742.0945 742.4942 759.9296 760.1604 762.7832 769.9430 845.6334 859.7562 860.0715 884.0217 943.5149 944.6256 953.6996 954.2766 989.2751 989.5220 993.1322 993.2450 1007.9135 1024.0058 1043.0422 1043.3700 1095.1265 1104.2794 1113.9197 1114.5248 1139.6653 1149.4363 1153.0298 1158.1660 1174.3041 1174.5845 1206.2450 1206.9597 1233.4095 1236.1977 1296.1797 1296.3589 1325.7357 1326.4440 1389.7671 1390.3252 1431.0736 1431.5088 1448.3932 1448.7158 1468.7632 1468.8254 1469.2026 1469.7274 1483.1997 1483.7740 1502.1950 1511.2220 1564.9259 1568.4112 1592.5590 1594.5203 1607.1979 1607.4276 1690.7666 2963.0778 2963.4360 3019.1991 3019.8676 3052.2636 3052.6300 3124.1451 3124.2893 3133.4389 3133.5048 3150.0301 3150.1323 3163.7851 3164.0442 3173.3974 3173.5882 3345.2870 3355.1767
redmass: 4.4784 6.2743 5.4996 5.8460 4.4152 5.4644 3.3757 3.3311 4.1783 4.4098 5.4765 3.4629 4.4206 5.9524 2.7343 2.2693 2.5954 1.5865 1.5489 3.6933 3.3664 6.0856 3.3557 3.8988 6.3272 6.5388 3.4473 3.1747 3.7978 6.5782 6.8234 1.5464 3.3834 3.4082 5.1058 5.7802 1.3840 4.8151 5.8226 7.7474 6.3679 3.4888 3.5210 1.3090 1.3030 5.6944 6.1053 4.9438 1.4091 1.4085 4.3570 1.4272 1.4144 1.4213 1.4313 8.7271 8.6890 1.3433 1.3435 5.8597 7.6434 2.1080 2.0662 2.6493 2.2867 1.2589 1.2589 2.4813 1.6984 1.4027 2.2803 1.0968 1.0973 1.9518 2.0732 2.3903 2.2787 1.5418 1.5429 1.6911 1.7302 5.9321 6.0184 1.5119 1.5190 1.6661 1.6564 1.0679 1.1693 1.2494 1.3482 1.4362 1.5380 1.9197 1.7143 6.9033 6.6918 6.3615 6.2093 6.4672 6.4578 8.7168 1.0327 1.0327 1.0877 1.0877 1.1041 1.1041 1.0997 1.0997 1.0858 1.0858 1.0900 1.0900 1.0940 1.0940 1.0997 1.0996 1.0750 1.0742
irintensity: 0.0328 0.8122 0.6592 8.8823 0.0330 5.0959 12.0759 8.6302 6.4329 0.3919 0.8488 0.1695 1.3781 10.5893 8.1844 0.0037 39.5112 1.3095 0.2262 3.4454 4.3334 10.7049 0.0479 1.1933 1.0483 3.6004 0.1045 10.4995 0.3397 4.3913 6.0348 3.5126 2.4511 0.4173 1.9677 6.6425 166.3628 35.3236 6.1882 19.1587 14.6838 0.0526 0.1612 26.4377 162.7744 11.1457 1.9862 2.0380 0.0512 0.0915 5.8651 1.4576 22.1547 2.4961 42.6727 60.9860 53.0780 0.9715 3.7295 1.2266 48.5131 19.7324 18.8204 64.7211 162.7585 0.3351 0.3649 1754.6702 0.2049 127.7421 2.7823 12.0715 2.4901 21.2571 70.3268 94.9185 216.4937 8.3091 6.2682 30.9943 8.0351 7.2800 60.9370 19.2715 51.5373 31.0436 27.9695 13.3908 75.9810 101.3400 1.7192 3.3862 52.8886 746.5672 21.4913 2.1886 35.3540 20.3343 4.0196 9.7808 55.6132 188.9843 96.0551 81.5497 51.2610 42.6895 43.1400 48.5807 18.9345 23.0072 0.6535 0.5187 11.2095 12.5834 15.7492 15.8299 38.3340 20.1964 50.7457 3.7751
temp: 298.150 k
press: 1.00000 atm
elementType: 8 8 8 7 7 7 7 6 6 6 6 6 6 6 6 6 6 6 6 6 6 6 6 6 1 1 1 1 1 1 1 1 1 1 1 1 1 1 1 1 1 1
symmnumber: 1
zpe: 852285.6 jmol-1
zpe.correction: 0.324618 hartree
zpe.thermalcorrener: 0.347759 hartree
zpe.thermalcorrenthalpy: 0.348703 hartree
zpe.thermalcorrgfe: 0.268777 hartree
zpe.sumelectzpe: -1101.466437 hartree
zpe.sumelectthermal: -1101.443296 hartree
zpe.sumelectthermalent: -1101.442352 hartree
zpe.sumelectthermalfe: -1101.522278 hartree
dipole: 0.0055 8.2416 0.0110
dipole: 8.2416
quadrupole: -71.8049 -125.7546 -146.9173
quadrupole: -0.0216 2.7308 -0.0221
quadrupole: 43.0207 -10.9290 -32.0917 -0.0216 2.7308 -0.0221
hfenergy: -1101.7910556 hartree
pointgroup: C01 [X(C17H18N4O3)]
dipole: -0.0283346 -0.7796386 3.1472311 debye
polarizability: 553.5900852|-36.1776118|111.0040675|-6.082462|-34.7853495|243.7546419 unknown
InChI: InChI=1S/C17H18N4O3/c1-23-15-9-5-3-7-13(15)11-18-20-17(22)21-19-12-14-8-4-6-10-16(14)24-2/h3-12,20-21H,1-2H3
charge 0 multiplicity 1
42 atoms
O  5.554745 -1.236708 1.681436
O  -5.606131 0.253709 1.939964
O  0.013896 0.465111 -2.059158
N  2.401253 -0.058632 -0.635935
N  -2.399558 0.287933 -0.595157
N  1.145121 -0.174949 -0.079186
N  -1.153372 0.141558 -0.023789
C  4.790876 -0.351906 -0.417006
C  -4.795111 0.44209 -0.313151
C  5.891777 -0.762519 0.399688
C  -5.915164 0.422815 0.577081
C  5.06459 0.136584 -1.723299
C  -5.040322 0.607825 -1.703264
C  7.219064 -0.683076 -0.083217
C  -7.233052 0.566076 0.083173
C  6.384075 0.217529 -2.208269
C  -6.350333 0.750216 -2.199517
C  7.460176 -0.19274 -1.38622
C  -7.44568 0.729307 -1.304164
C  3.423811 -0.445825 0.102524
C  -3.43766 0.294904 0.219187
C  6.643154 -1.681337 2.553919
C  -6.715921 0.223195 2.894498
C  0.003093 0.174471 -0.847358
H  4.213057 0.444909 -2.338275
H  -4.174332 0.622042 -2.372757
H  8.062091 -0.995987 0.539484
H  -8.090779 0.552247 0.76164
H  6.575174 0.595511 -3.217749
H  -6.519181 0.877492 -3.273634
H  8.489918 -0.133277 -1.755784
H  -8.468362 0.840145 -1.681412
H  3.308182 -0.851324 1.124364
H  -3.342781 0.19231 1.315786
H  7.196466 -2.529312 2.106093
H  7.345169 -0.85418 2.775036
H  6.152217 -2.008379 3.482396
H  -6.245159 0.080024 3.878347
H  -7.280164 1.175803 2.88664
H  -7.403829 -0.618491 2.684256
H  1.03031 -0.563455 0.870682
H  -1.056626 0.056585 1.000804
