program: Gaussian 09
title: 000240409
version: EM64L-G09RevD.01
frameworkgroup: C1[X(C15H30N2)]
method: RPBEPBE
basis: SDD
operation: Freq
keyword: #pfreq=noraman
keyword: PBEPBE/SDD
title: #p freq=noraman PBEPBE/SDD
converged: YES YES NO NO
title: Mulliken charges:
elementType: N N C C C C C C C C C C C C C C C H H H H H H H H H H H H H H H H H H H H H H H H H H H H H H
charge: -0.068153 -0.068159 -0.365955 -0.354870 -0.354874 -0.365956 -0.349615 -0.349604 -0.390298 -0.398042 -0.398040 -0.390297 -0.396408 -0.396406 -0.397726 -0.397727 -0.358687 0.162577 0.209792 0.207644 0.164839 0.207647 0.164840 0.162578 0.209789 0.200827 0.173607 0.173609 0.200819 0.189386 0.203518 0.205028 0.189499 0.189500 0.205028 0.203518 0.189386 0.209461 0.199452 0.199453 0.209457 0.187660 0.212003 0.187660 0.212003 0.185120 0.185118
chargesum: 0.00000
title: Mulliken charges with hydrogens summed into heavy atoms:
elementType: N N C C C C C C C C C C C C C C C
charge: -0.068153 -0.068159 0.006413 0.017613 0.017613 0.006411 0.024819 0.024824 0.002606 -0.003515 -0.003513 0.002607 0.012506 0.012505 0.001936 0.001937 0.011550
polarizability: 2.21225264e+02 -1.18651358e-03 1.52148444e+02 2.67962189e+00 -1.13089292e-04 1.50730684e+02
1716.lowfreq: -0.0010 0.0006 0.0011 5.6296 6.3046 20.2034 27.2318 32.0878 37.5943
frequency: 27.1666 29.4635 37.5778 60.6539 68.0551 87.4727 115.5251 131.5689 145.2829 161.6654 197.1321 236.3722 239.6140 268.1119 304.3462 310.3027 330.5210 363.2786 387.0056 396.5552 443.5364 448.2432 448.9894 480.8901 482.6294 559.9301 578.6296 732.3900 750.6588 761.1572 761.3964 805.7152 806.1908 831.4193 853.4377 855.7112 858.0217 859.2280 903.4704 908.3645 956.3390 960.1246 961.3914 983.1228 989.1755 1022.2011 1033.9636 1050.4913 1050.5549 1061.1635 1065.2541 1077.0749 1095.2442 1105.1079 1109.1083 1121.1510 1123.0138 1136.8972 1150.3053 1152.7890 1155.8685 1157.0405 1162.4663 1211.5730 1230.8837 1238.6274 1258.0707 1258.5592 1265.6495 1266.4745 1273.6776 1281.2448 1286.2138 1289.8737 1291.3752 1299.0129 1310.2321 1330.3548 1330.9598 1339.7620 1341.8595 1342.7847 1345.3339 1348.3131 1351.0167 1353.8956 1369.9488 1370.3791 1391.2901 1393.4432 1451.5728 1451.5950 1458.2225 1459.9842 1461.3925 1461.4621 1464.9328 1467.9269 1469.1540 1469.4264 1472.8718 1476.6008 1480.0222 1484.2466 1490.1625 2803.8723 2803.9174 2812.0263 2812.2997 2833.3641 2833.8348 2951.6668 2965.7083 2965.7398 2977.6256 2982.6589 2983.3949 2983.4372 2984.5124 2984.5960 2994.5296 2999.7216 3000.4829 3020.2332 3020.3468 3031.0064 3031.0413 3037.7670 3039.8824 3042.4175 3043.8748 3044.1905 3053.2385 3053.2831 3054.8778
redmass: 2.8997 3.4791 3.6241 2.1162 3.4735 2.3222 2.3364 2.8815 2.7709 3.1555 2.4309 1.8665 1.7943 2.5605 2.0986 2.1384 3.3462 2.7706 1.7420 1.9648 2.8640 3.0889 2.9160 2.3766 3.0445 1.7903 1.9952 1.0706 2.5376 3.5024 1.3186 1.4805 1.4674 1.3026 2.3514 2.6930 1.5495 1.4029 2.2476 2.2986 1.2836 1.2957 1.2979 2.8376 2.7109 3.2166 3.2641 2.1912 2.1029 1.8093 1.6211 2.1909 2.4076 1.9688 2.0588 2.4911 2.5958 1.5718 1.3229 1.3339 1.9346 2.3631 1.4525 1.5435 1.3319 1.8577 1.3043 1.2646 1.1689 1.1849 1.4301 1.1011 1.2240 1.2592 1.3079 1.2665 1.3751 1.2711 1.2852 1.3747 1.4105 1.4700 1.4887 1.5174 1.4674 1.5438 1.4069 1.3936 1.4354 1.4418 1.0917 1.0917 1.0793 1.0804 1.0879 1.0874 1.0755 1.0965 1.0782 1.0820 1.0901 1.0936 1.0971 1.0978 1.0999 1.0717 1.0717 1.0703 1.0703 1.0695 1.0697 1.0587 1.0624 1.0624 1.0612 1.0611 1.0613 1.0613 1.0616 1.0617 1.0955 1.0851 1.0891 1.0873 1.0873 1.0954 1.0955 1.0963 1.0888 1.0967 1.1025 1.1001 1.1033 1.1033 1.1028
irintensity: 0.1621 0.0560 0.0045 0.4053 0.0002 0.3087 0.0002 0.1437 0.0542 0.0274 1.7018 0.0934 1.1658 1.7902 4.4642 0.9528 0.1264 3.3359 3.3480 2.9265 2.1592 0.0041 0.3137 2.3946 0.2608 0.0695 2.0147 8.2813 5.0315 15.6881 0.9591 0.3971 0.0523 0.5765 1.0973 15.9880 3.3856 3.2417 0.3137 4.8426 3.3983 5.1346 0.1780 20.3252 0.3356 21.4165 5.5276 1.6348 2.1482 5.1787 33.9891 0.5453 0.4410 46.3672 6.5757 2.5684 9.7397 8.2427 9.7235 8.4291 1.1741 47.0851 0.6234 18.1918 0.0118 5.6032 4.9410 2.7575 4.9960 6.9094 9.1550 0.8458 5.7965 2.5777 0.0350 20.8869 1.8663 16.1524 0.5560 11.1018 0.2409 10.6158 1.2535 1.2470 0.5449 2.2292 10.7188 0.4921 1.8095 0.0001 7.8423 5.8219 3.3213 4.8482 9.5265 14.4068 0.0658 19.2910 2.9192 0.0849 1.1231 5.2349 0.8448 1.6161 21.4287 14.0854 81.1432 107.2255 35.9245 115.5785 289.9321 26.3584 64.1762 13.4979 0.5101 65.7493 74.5069 0.0317 20.0645 36.7046 11.1400 25.2038 5.1718 41.9078 95.4066 134.0137 8.6423 12.4684 22.8584 27.2662 22.1258 0.6064 90.0107 109.7698 163.4161
temp: 298.150 k
press: 1.00000 atm
elementType: 7 7 6 6 6 6 6 6 6 6 6 6 6 6 6 6 6 1 1 1 1 1 1 1 1 1 1 1 1 1 1 1 1 1 1 1 1 1 1 1 1 1 1 1 1 1 1
symmnumber: 1
zpe: 1131927.3 jmol-1
zpe.correction: 0.431128 hartree
zpe.thermalcorrener: 0.449460 hartree
zpe.thermalcorrenthalpy: 0.450404 hartree
zpe.thermalcorrgfe: 0.382926 hartree
zpe.sumelectzpe: -697.665867 hartree
zpe.sumelectthermal: -697.647536 hartree
zpe.sumelectthermalent: -697.646591 hartree
zpe.sumelectthermalfe: -697.714069 hartree
dipole: 0.0000 -1.0183 -0.0003
dipole: 1.0183
quadrupole: -103.2895 -108.2779 -107.3371
quadrupole: 0.0007 -2.8809 -0.0004
quadrupole: 3.0119 -1.9764 -1.0356 0.0007 -2.8809 -0.0004
hfenergy: -698.0969953 hartree
pointgroup: C01 [X(C15H30N2)]
dipole: -0.0000108 -0.4006433 0.0000664 debye
polarizability: 221.2995903|-0.0011308|152.1484438|1.3911334|-0.0008631|150.6563579 unknown
InChI: InChI=1S/C15H30N2/c1-4-10-16(11-5-1)14-8-3-9-15-17-12-6-2-7-13-17/h1-15H2
charge 0 multiplicity 1
47 atoms
N  3.812595 -0.113839 0.169219
N  -3.812598 -0.113804 -0.169112
C  4.95419 -0.881938 0.729819
C  4.166575 0.47857 -1.146177
C  -4.166739 0.479162 1.145993
C  -4.954137 -0.882114 -0.729528
C  2.565964 -0.919215 0.115726
C  -2.565983 -0.919181 -0.115192
C  6.19228 0.018786 0.916087
C  5.382795 1.420217 -1.029988
C  -5.382916 1.420796 1.029244
C  -6.192177 0.018568 -0.916345
C  1.2859 -0.06144 0.030037
C  -1.285887 -0.061415 -0.029808
C  6.594845 0.678861 -0.422429
C  -6.594906 0.679213 0.421841
C  -0.000007 -0.918365 0.000275
H  5.229637 -1.746708 0.065951
H  4.642257 -1.303087 1.704255
H  3.296735 1.039981 -1.531007
H  4.398205 -0.328546 -1.894612
H  -3.296944 1.040706 1.530722
H  -4.398505 -0.327632 1.894731
H  -5.229694 -1.746593 -0.065327
H  -4.642083 -1.303687 -1.703743
H  2.5181 -1.522726 1.043941
H  2.583173 -1.64824 -0.738193
H  -2.583255 -1.647859 0.739024
H  -2.518087 -1.523069 -1.043158
H  7.028071 -0.582433 1.323694
H  5.948938 0.804777 1.657071
H  5.109329 2.275719 -0.382428
H  5.632038 1.822548 -2.03111
H  -5.632279 1.823565 2.030159
H  -5.109341 2.27601 0.381349
H  -5.948709 0.804242 -1.657623
H  -7.027929 -0.582798 -1.323816
H  1.267439 0.622686 0.900622
H  1.309126 0.578423 -0.874186
H  -1.309093 0.578786 0.874174
H  -1.267398 0.622386 -0.900648
H  6.938752 -0.105153 -1.129307
H  7.442627 1.374454 -0.274149
H  -6.93892 -0.104499 1.1290
H  -7.442654 1.37476 0.273155
H  -0.020728 -1.584527 0.88876
H  0.020693 -1.584849 -0.887967
