program: Gaussian 09
title: 000240400
version: EM64L-G09RevD.01
frameworkgroup: C1[X(C10H17NO2)]
method: RPBEPBE
basis: SDD
operation: Freq
keyword: #p
keyword: freq=noraman
keyword: PBEPBE/SDD
title: #p freq=noraman PBEPBE/SDD
converged: YES YES NO NO
title: Mulliken charges:
elementType: O O N C C C C C C C C C C H H H H H H H H H H H H H H H H H
charge: -0.324023 -0.306627 -0.156168 0.054315 -0.432961 -0.445455 0.307858 -0.688529 -0.683918 -0.028929 -0.021703 -0.575008 -0.577064 0.234373 0.254970 0.220192 0.261587 0.224052 0.208202 0.230680 0.220082 0.209855 0.255782 0.213636 0.236237 0.237193 0.218890 0.216831 0.219032 0.216617
chargesum: 0.00000
title: Mulliken charges with hydrogens summed into heavy atoms:
elementType: O O N C C C C C C C C C C
charge: -0.324023 -0.306627 -0.156168 0.288688 0.042201 0.040184 0.307858 -0.029564 -0.004645 0.207308 0.215490 -0.139288 -0.141415
polarizability: 1.69309154e+02 1.13555730e+01 1.11133607e+02 4.23793790e+00 -2.40823048e+00 9.24469544e+01
1716.lowfreq: -7.1281 -6.6632 0.0006 0.0007 0.0008 4.3534 22.2345 36.8699 38.7095
frequency: 22.1640 36.7767 38.6337 67.2451 78.8072 81.3320 108.3880 143.3493 158.1592 188.7142 228.8827 256.4116 269.7165 279.9319 343.0028 374.6559 399.7650 408.5765 420.0010 454.0000 521.2096 564.8474 658.4808 685.9341 702.0891 785.6707 823.4330 897.1992 899.2801 921.7491 925.9782 941.1371 944.7552 946.5216 954.3702 958.7156 1007.4941 1008.8888 1052.1030 1102.5242 1109.3183 1141.4836 1156.6446 1180.9654 1184.4269 1221.3958 1273.7117 1281.3216 1285.0520 1316.7530 1335.4071 1338.6089 1345.0491 1379.3756 1394.7154 1396.6403 1425.3414 1427.7804 1456.2510 1457.2672 1462.2365 1464.3178 1473.0195 1487.2014 1624.6149 1655.7599 1656.7953 2986.6620 2991.2614 2994.8105 3007.2135 3029.5199 3061.8648 3081.2502 3082.4484 3084.0018 3085.1202 3091.8180 3096.8313 3102.9056 3105.1440 3105.3903 3194.6680 3195.4332
redmass: 3.5111 3.3934 2.9359 4.0188 3.3469 2.6316 4.8778 2.8533 2.2137 1.0312 1.1470 3.1459 2.4630 3.3493 3.1246 2.5448 3.1903 1.8867 3.2552 2.3233 2.0360 2.0441 2.1911 3.3010 4.6982 4.0926 3.5870 1.4634 2.2482 1.7087 1.2323 1.3816 1.8652 1.8482 1.5219 1.5556 1.1560 1.1563 3.2970 1.8234 2.0034 2.2956 2.0346 2.0608 2.7462 1.6774 1.4118 1.2386 1.2630 1.3493 1.2242 1.3521 1.2657 1.2673 1.3370 2.0932 1.1810 1.2111 1.0818 1.0696 1.1150 1.0472 1.0506 1.0488 9.3844 4.6430 4.6332 1.0356 1.0359 1.0604 1.0639 1.0865 1.1006 1.0993 1.0808 1.0607 1.0751 1.0986 1.1004 1.1006 1.0956 1.0954 1.1142 1.1142
irintensity: 0.0424 0.0964 0.0611 3.6729 0.9514 0.0126 0.6155 1.3071 3.6565 0.0323 0.1257 2.3716 0.4575 8.2405 5.2816 7.3298 10.5772 7.5169 6.9336 3.8452 0.4201 2.6508 4.2641 22.6706 28.3594 0.8422 30.8198 5.7155 11.6041 53.8478 2.1460 0.3016 19.1749 13.8399 165.1797 0.8133 8.1773 18.6573 136.0361 176.9264 29.3455 160.0346 13.5177 32.2135 17.0493 245.6642 12.2685 2.1055 6.4088 13.1258 2.8324 9.2727 5.7198 37.2757 93.6122 96.6657 0.5401 13.5307 36.6645 5.1267 21.8742 6.7421 5.9607 22.3769 374.4621 44.5717 3.2593 17.2808 27.0605 29.0369 24.6067 5.7527 3.0449 7.2590 6.8504 9.1331 10.2074 62.6057 22.6397 27.1652 17.6425 1.3744 48.6483 2.9529
temp: 298.150 k
press: 1.00000 atm
elementType: 8 8 7 6 6 6 6 6 6 6 6 6 6 1 1 1 1 1 1 1 1 1 1 1 1 1 1 1 1 1
symmnumber: 1
zpe: 663261.7 jmol-1
zpe.correction: 0.252623 hartree
zpe.thermalcorrener: 0.268497 hartree
zpe.thermalcorrenthalpy: 0.269442 hartree
zpe.thermalcorrgfe: 0.207376 hartree
zpe.sumelectzpe: -595.396790 hartree
zpe.sumelectthermal: -595.380916 hartree
zpe.sumelectthermalent: -595.379971 hartree
zpe.sumelectthermalfe: -595.442037 hartree
dipole: 0.2880 1.9151 0.9860
dipole: 2.1732
quadrupole: -67.3643 -84.2802 -79.5168
quadrupole: -0.3861 -0.5371 -5.3193
quadrupole: 9.6895 -7.2265 -2.4631 -0.3861 -0.5371 -5.3193
hfenergy: -595.649413 hartree
pointgroup: C01 [X(C10H17N1O2)]
dipole: -0.185859 -0.7387443 -0.3882459 debye
polarizability: 153.3735152|-27.9571481|126.472089|-7.9737711|0.9817684|93.0441116 unknown
InChI: InChI=1S/C10H17NO2/c1-5-7-11(8-6-2)10(12)13-9(3)4/h5-6,9H,1-2,7-8H2,3-4H3
charge 0 multiplicity 1
30 atoms
O  -1.598799 0.387542 -0.227654
O  -0.219755 1.91049 0.924942
N  0.633973 -0.105805 0.073191
C  -2.763244 1.315389 -0.010615
C  0.417254 -1.387835 -0.641219
C  1.98795 0.162897 0.615766
C  -0.369837 0.815678 0.311273
C  -3.73604 1.010633 -1.152513
C  -3.346605 1.069191 1.388009
C  0.296488 -2.561503 0.316084
C  2.992935 0.465342 -0.480111
C  1.117775 -3.640788 0.312861
C  4.1414 -0.227968 -0.680167
H  -2.371443 2.347171 -0.077649
H  -0.503323 -1.288584 -1.238906
H  1.26625 -1.548397 -1.331855
H  1.890514 1.030889 1.292321
H  2.318345 -0.711038 1.208952
H  -4.620777 1.668636 -1.078049
H  -3.256726 1.178526 -2.132152
H  -4.078274 -0.038469 -1.105101
H  -4.217959 1.728824 1.555908
H  -2.594455 1.288657 2.164087
H  -3.6796 0.020675 1.490288
H  -0.524081 -2.494058 1.04556
H  2.74175 1.317896 -1.128091
H  0.981627 -4.470698 1.015384
H  1.94541 -3.729437 -0.402924
H  4.849335 0.045776 -1.470401
H  4.412713 -1.082333 -0.04632
