program: Gaussian 09
title: 000236857
version: EM64L-G09RevD.01
frameworkgroup: C1[X(C10H13N3O)]
method: RPBEPBE
basis: SDD
operation: Freq
keyword: #p
keyword: freq=noraman
keyword: PBEPBE/SDD
title: #p freq=noraman PBEPBE/SDD
converged: YES YES NO NO
title: Mulliken charges:
elementType: O N N N C C C C C C C C C C H H H H H H H H H H H H H
charge: -0.248914 0.005612 -0.403475 -0.651348 0.343064 0.452327 -0.373511 -0.360726 0.070470 -0.443413 -0.360140 -0.809199 -0.807925 0.297144 0.205193 0.291087 0.226781 0.229564 0.231518 0.222571 0.231223 0.255306 0.241146 0.227578 0.284448 0.299041 0.344578
chargesum: 0.00000
title: Mulliken charges with hydrogens summed into heavy atoms:
elementType: O N N N C C C C C C C C C C
charge: -0.248914 0.005612 -0.119028 -0.007729 0.343064 0.452327 -0.168318 -0.069639 0.070470 -0.216632 -0.130576 -0.123886 -0.083895 0.297144
polarizability: 2.53390944e+02 1.53231840e+00 1.39347085e+02 4.86417640e-01 -2.31896969e+00 6.40928699e+01
1716.lowfreq: -9.0336 -1.7037 -0.0005 -0.0002 0.0007 3.6340 29.1031 31.0326 41.5469
frequency: 29.0323 31.0215 41.4560 71.4986 77.3759 95.1173 123.7809 206.8872 227.6826 265.9679 272.3842 310.4109 341.8107 364.8494 405.9158 422.2764 464.5998 489.5922 495.0998 534.4604 573.7807 584.2831 620.6765 637.3158 709.2956 720.0503 725.9090 803.2394 822.3396 859.1186 927.4509 948.8709 961.2322 987.0351 1002.2604 1008.2834 1028.0323 1041.6979 1046.9784 1067.9564 1124.6090 1147.0434 1198.1382 1227.2370 1289.9782 1309.3100 1321.1846 1363.8762 1389.5513 1396.6804 1412.8243 1453.2501 1468.9204 1473.0738 1481.7442 1495.9378 1520.2897 1551.0519 1579.0517 1603.9587 1623.6980 1683.1394 2959.0923 2974.3037 3026.3663 3051.4790 3083.0972 3117.8340 3121.0523 3123.2558 3147.0047 3165.8449 3407.2386 3537.7391 3695.6971
redmass: 2.5361 3.1530 1.2791 4.4070 3.7194 1.2542 3.5503 4.2521 2.3570 2.8654 2.2394 3.1637 2.8459 3.5535 2.8368 3.6347 1.7122 1.9043 1.8520 1.8203 3.9715 2.2899 5.7687 6.9184 8.1730 3.5104 2.9153 5.0720 1.4529 1.2940 3.0491 1.3615 2.0609 1.4594 1.3499 2.9886 1.5607 2.3883 1.5604 2.7885 1.8337 2.2603 1.1260 2.8664 2.6148 1.3169 3.8110 3.9180 1.2865 1.2404 3.4656 1.2407 1.0466 1.1131 1.1286 1.7356 1.9070 6.8390 6.0278 1.2170 6.3466 5.3838 1.0419 1.0372 1.0975 1.0974 1.0986 1.0889 1.0902 1.0907 1.0943 1.0949 1.0744 1.0459 1.1034
irintensity: 2.1289 17.4716 0.0206 5.6283 4.6811 0.5614 0.3840 1.8146 2.7806 4.0325 6.7343 3.0824 1.6020 46.3842 2.2086 11.4103 143.3936 87.8350 41.7545 100.9349 5.3753 26.7583 3.8303 0.4092 17.4197 10.4524 5.2565 2.0154 40.4934 16.8484 0.8946 0.8076 4.1852 4.6965 4.0213 9.2770 2.0189 47.8425 12.9469 3.0834 83.4235 109.8647 5.0359 0.1854 544.9619 1.9973 46.7280 1.6008 25.2429 9.0533 7.6553 183.2094 13.0631 24.7197 85.1690 186.4599 49.0053 31.9995 8.6607 144.3434 15.2379 265.9265 20.7109 44.3251 20.1811 21.5291 20.8614 25.7175 19.9924 6.6815 30.4434 2.5623 12.9367 58.6017 45.3398
temp: 298.150 k
press: 1.00000 atm
elementType: 8 7 7 7 6 6 6 6 6 6 6 6 6 6 1 1 1 1 1 1 1 1 1 1 1 1 1
symmnumber: 1
zpe: 567458.1 jmol-1
zpe.correction: 0.216133 hartree
zpe.thermalcorrener: 0.230912 hartree
zpe.thermalcorrenthalpy: 0.231856 hartree
zpe.thermalcorrgfe: 0.172298 hartree
zpe.sumelectzpe: -627.304217 hartree
zpe.sumelectthermal: -627.289439 hartree
zpe.sumelectthermalent: -627.288494 hartree
zpe.sumelectthermalfe: -627.348052 hartree
dipole: 1.2812 5.5073 -0.1131
dipole: 5.6555
quadrupole: -53.7262 -80.0232 -87.6338
quadrupole: 17.1133 -0.8852 -0.6196
quadrupole: 20.0682 -6.2288 -13.8394 17.1133 -0.8852 -0.6196
hfenergy: -627.5203506 hartree
pointgroup: C01 [X(C10H13N3O1)]
dipole: -0.4796878 -2.1628737 -0.2065681 debye
polarizability: 253.1121968|3.4741648|138.5363487|-6.3054819|8.3036148|65.1823539 unknown
InChI: InChI=1S/C10H13N3O/c1-7-3-5-9(6-4-7)8(2)12-13-10(11)14/h3-6,13H,11H2,1-2H3
charge 0 multiplicity 1
27 atoms
O  -3.565742 1.852939 0.340406
N  -1.473078 -0.008284 0.095926
N  -2.800783 -0.379583 0.115373
N  -5.091853 0.098722 0.148415
C  0.863456 -0.48155 0.022561
C  3.570905 0.502254 -0.028958
C  1.959868 -1.356877 -0.199906
C  1.149961 0.904376 0.213425
C  -0.546388 -0.956312 0.052774
C  3.28672 -0.870191 -0.224768
C  2.470849 1.379088 0.188617
C  4.994785 1.028118 -0.048137
C  -0.889839 -2.439691 0.03753
C  -3.79791 0.626042 0.209162
H  1.797282 -2.426364 -0.371478
H  0.309967 1.585694 0.378323
H  4.112028 -1.570657 -0.40168
H  2.660047 2.448921 0.34257
H  5.265275 1.490011 0.920474
H  5.721632 0.223026 -0.251804
H  5.12523 1.806327 -0.8238
H  -0.000158 -3.071363 0.163815
H  -1.37658 -2.736155 -0.913898
H  -1.581055 -2.696046 0.866413
H  -3.083594 -1.36761 0.073789
H  -5.308739 -0.880505 -0.025752
H  -5.855484 0.765171 0.228107
