program: Gaussian 09
title: 000236856
version: EM64L-G09RevD.01
frameworkgroup: C1[X(C10H10N2O5)]
method: RPBEPBE
basis: SDD
operation: Freq
keyword: #p
keyword: freq=noraman
keyword: PBEPBE/SDD
title: #p freq=noraman PBEPBE/SDD
converged: NO YES NO NO
title: Mulliken charges:
elementType: O O O O O N N C C C C C C C C C C H H H H H H H H H H
charge: -0.287954 -0.241468 -0.178942 -0.257230 -0.239978 -0.433560 0.029335 0.357878 0.200003 0.291709 -0.488858 -0.301777 -0.342527 0.173016 0.219908 -0.783798 -0.497888 0.323217 0.323967 0.281768 0.362568 0.247943 0.267075 0.247719 0.246231 0.235466 0.246176
chargesum: 0.00000
title: Mulliken charges with hydrogens summed into heavy atoms:
elementType: O O O O O N N C C C C C C C C C C
charge: -0.287954 -0.241468 -0.178942 -0.257230 -0.239978 -0.070992 0.029335 0.357878 0.200003 0.291709 -0.165641 0.022191 -0.060759 0.173016 0.219908 -0.021060 0.229985
polarizability: 2.42695322e+02 3.72887564e+00 1.73849484e+02 -8.92969356e-03 5.52116020e-03 6.45550113e+01
1716.lowfreq: -42.2074 -4.6782 -0.0003 0.0005 0.0006 4.4745 7.0155 46.7078 50.1390
frequency: -42.2050 46.7032 50.1357 54.0056 87.9092 97.9214 102.1096 132.1900 154.6444 158.3243 194.0268 234.8696 253.5287 294.1487 324.5712 331.0457 363.4424 421.0503 433.7182 476.5818 523.3509 530.5233 587.8570 597.4646 661.9694 663.6502 681.8916 729.1153 740.8658 753.0621 804.0669 845.5755 888.6872 899.9957 931.5227 948.6771 968.4524 988.7957 1021.4678 1037.5507 1064.5366 1088.3720 1115.1730 1146.8432 1151.2636 1162.5162 1215.2876 1234.6504 1267.6757 1305.4545 1339.0516 1360.0880 1382.5028 1425.1474 1427.4323 1447.7991 1452.8195 1463.1897 1464.2168 1496.4796 1512.9628 1575.4448 1620.2646 1630.0373 1640.9905 2993.7803 3006.3956 3078.4316 3108.9857 3140.4204 3152.7500 3176.4786 3178.5684 3197.0958 3257.1903
redmass: 1.0516 5.4044 8.6086 5.5005 4.3753 4.9614 1.1859 3.8036 5.4105 5.2181 5.1983 6.7949 6.8783 5.3233 6.2556 5.9546 8.6324 5.2058 4.0546 8.1885 5.4011 3.7392 3.0103 5.6442 6.9353 8.0862 7.3321 7.7435 4.3692 7.1828 5.9506 6.1247 1.4421 1.1096 5.9703 7.5186 1.4321 1.7316 1.3267 1.6835 2.8931 3.8460 1.2639 1.6523 1.5643 4.3599 2.1465 2.6479 3.0893 1.9797 6.5523 4.3051 1.2390 1.2073 5.3806 1.1277 1.0492 1.0518 1.0458 3.1755 2.9322 3.7956 6.2369 9.0394 4.8455 1.0383 1.0296 1.0978 1.1047 1.0989 1.1049 1.0903 1.0920 1.0962 1.0798
irintensity: 0.8924 3.7638 0.5896 0.7326 4.3592 2.1905 1.9965 3.2553 8.1684 0.4363 6.7683 5.2632 0.5462 6.9654 12.0876 1.1274 1.0378 2.3005 0.5735 14.8445 8.3796 8.1207 0.0014 0.5817 14.3454 18.0728 15.7543 6.5893 13.7230 9.5048 2.8069 1.8893 51.3754 68.5169 1.2460 33.8643 14.2299 49.7714 3.2682 12.0785 33.6346 124.6307 0.0146 112.0950 134.6937 227.3016 418.7768 11.5202 172.7583 15.7909 527.6362 65.1478 71.5630 43.0350 21.8410 30.4797 15.1547 13.0234 20.2724 20.7876 401.1785 225.6052 217.9050 113.5698 110.3357 2.2837 38.3270 9.0482 23.9458 8.6906 14.4955 1.0176 13.8622 7.7125 133.2910
temp: 298.150 k
press: 1.00000 atm
elementType: 8 8 8 8 8 7 7 6 6 6 6 6 6 6 6 6 6 1 1 1 1 1 1 1 1 1 1
symmnumber: 1
zpe: 510182.0 jmol-1
zpe.correction: 0.194318 hartree
zpe.thermalcorrener: 0.209914 hartree
zpe.thermalcorrenthalpy: 0.210858 hartree
zpe.thermalcorrgfe: 0.150023 hartree
zpe.sumelectzpe: -871.392614 hartree
zpe.sumelectthermal: -871.377018 hartree
zpe.sumelectthermalent: -871.376074 hartree
zpe.sumelectthermalfe: -871.436909 hartree
dipole: 0.1945 -3.0575 -0.0028
dipole: 3.0637
quadrupole: -76.1403 -118.7120 -96.9862
quadrupole: -11.0586 0.0158 0.0137
quadrupole: 21.1392 -21.4325 0.2933 -11.0586 0.0158 0.0137
hfenergy: -871.586932 hartree
pointgroup: C01 [X(C10H10N2O5)]
dipole: 0.0654316 -1.2029977 0.0375101 debye
polarizability: 242.7109889|3.1824368|173.6838102|2.8018306|-3.3492956|64.7050188 unknown
InChI: InChI=1S/C10H10N2O5/c1-6(13)11-8-4-3-7(10(14)17-2)5-9(8)12(15)16/h3-5,11H,1-2H3
charge 0 multiplicity 1
27 atoms
O  3.805132 -1.289381 0.13811
O  3.851371 1.04182 0.065806
O  -0.440384 3.38124 -0.077726
O  -2.449623 2.326996 -0.077145
O  -3.007043 -2.604694 0.068931
N  -2.553294 -0.289377 0.00242
N  -1.136668 2.301968 -0.054216
C  -1.154893 -0.257103 0.023966
C  -0.446629 1.002373 -0.003393
C  1.714452 -0.13718 0.06789
C  0.964454 1.050091 0.018515
C  -0.365664 -1.447581 0.073176
C  1.032438 -1.38648 0.094542
C  3.201012 -0.031052 0.09061
C  -3.410689 -1.409661 0.024974
C  -4.885047 -1.028425 -0.012523
C  5.287315 -1.281924 0.161573
H  1.4723 2.018304 -0.002887
H  -0.889077 -2.404362 0.093591
H  1.618852 -2.308427 0.132509
H  -2.976895 0.657465 -0.036047
H  -5.155831 -0.402992 0.857925
H  -5.489762 -1.946082 0.002986
H  -5.124031 -0.453733 -0.926161
H  5.679321 -0.793614 -0.74625
H  5.571788 -2.342494 0.198027
H  5.650696 -0.739498 1.050398
