program: Gaussian 09
title: 000236855
version: EM64L-G09RevD.01
frameworkgroup: C1[X(C9H6Br2O4S)]
method: RPBEPBE
basis: SDD
operation: Freq
keyword: #p
keyword: freq=noraman
keyword: PBEPBE/SDD
title: #p freq=noraman PBEPBE/SDD
converged: YES YES NO NO
title: Mulliken charges:
elementType: Br Br S O O O O C C C C C C C C C H H H H H H
charge: 0.090423 0.086875 0.279149 -0.428774 -0.233271 -0.412908 -0.218401 -0.362026 0.341944 -0.149833 -0.288560 -0.164986 -0.178949 -0.702306 0.102846 0.242081 0.292160 0.299141 0.295075 0.331222 0.394001 0.385095
chargesum: 0.00000
title: Mulliken charges with hydrogens summed into heavy atoms:
elementType: Br Br S O O O O C C C C C C C C C
charge: 0.090423 0.086875 0.279149 -0.034774 -0.233271 -0.027813 -0.218401 -0.362026 0.341944 0.142327 0.010581 -0.164986 -0.178949 -0.076008 0.102846 0.242081
polarizability: 2.49655523e+02 7.18509837e+00 1.68044052e+02 -6.73488186e+00 2.88800242e+00 8.90791609e+01
1716.lowfreq: -1.5277 0.0009 0.0010 0.0011 2.1908 3.9685 22.8171 26.8531 33.1115
frequency: 22.8001 26.8443 33.1064 43.6888 60.4276 118.3316 120.8410 125.6903 148.6168 155.7053 185.5191 188.8482 240.0322 269.3432 290.9553 366.4483 371.7298 421.8115 445.0563 502.1092 509.2020 530.3311 563.3759 574.6105 620.0328 630.8984 633.2776 677.6765 692.9910 739.8381 763.2182 812.7288 870.4020 895.1163 906.0829 928.2849 1008.0302 1046.1509 1061.4596 1112.6387 1143.1545 1158.2777 1221.7046 1252.1953 1272.3228 1314.9597 1335.4080 1356.7244 1430.4296 1431.1137 1518.3730 1559.8818 1631.2843 1670.5589 3036.5164 3109.0970 3168.7058 3174.4413 3510.8412 3515.3295
redmass: 9.5094 11.1472 14.9461 8.1961 7.5211 7.6283 11.4445 8.4701 6.6463 9.4779 11.9246 6.4883 16.2074 13.4027 9.4136 8.4477 7.9378 9.4936 3.2480 1.8914 6.8971 4.9664 3.9583 2.1119 3.4208 2.8669 1.7105 6.3503 4.2888 6.4192 5.0042 9.4580 4.9521 1.6569 1.4859 1.4634 8.4850 2.1879 4.2110 2.2779 1.2672 1.8318 1.3230 1.1891 3.4196 2.2017 4.5983 7.4581 2.2838 1.2185 10.6584 7.1866 8.8621 8.7682 1.0569 1.1051 1.0920 1.0927 1.0639 1.0641
irintensity: 0.4110 0.6934 0.5420 1.6196 0.9138 2.4423 1.4881 0.2763 1.4035 1.4959 0.3098 0.8524 0.5078 1.5660 0.0723 15.6367 5.8476 16.4547 21.6346 43.4833 18.9879 3.1082 40.1316 70.0638 47.6615 27.1634 119.0192 11.6043 36.7467 20.3749 13.0376 47.8145 7.9827 17.7438 3.8377 24.4654 92.6260 383.8096 106.9061 91.4755 18.4707 96.5704 1.3977 2.0101 15.3178 99.6362 72.1645 81.9997 67.7919 26.6736 14.1047 94.6332 277.7772 212.9725 32.4903 4.3858 3.4151 0.1323 53.7775 29.2272
temp: 298.150 k
press: 1.00000 atm
elementType: 35 35 16 8 8 8 8 6 6 6 6 6 6 6 6 6 1 1 1 1 1 1
symmnumber: 1
zpe: 350060.7 jmol-1
zpe.correction: 0.133331 hartree
zpe.thermalcorrener: 0.150035 hartree
zpe.thermalcorrenthalpy: 0.150979 hartree
zpe.thermalcorrgfe: 0.084106 hartree
zpe.sumelectzpe: -1071.270472 hartree
zpe.sumelectthermal: -1071.253769 hartree
zpe.sumelectthermalent: -1071.252824 hartree
zpe.sumelectthermalfe: -1071.319697 hartree
dipole: 1.4961 -0.3512 2.7463
dipole: 3.1470
quadrupole: -108.2380 -117.6104 -122.0971
quadrupole: 4.8610 12.8875 0.2539
quadrupole: 7.7438 -1.6286 -6.1153 4.8610 12.8875 0.2539
hfenergy: -1071.4038032 hartree
pointgroup: C01 [X(C9H6Br2O4S1)]
dipole: 0.6596944 0.2693357 -1.0125474 debye
dipolederiv: -0.139234 0.2606216 0.0577271 0.3489837 -0.5645156 -0.1312589 0.0706621 -0.1332085 -0.0062039 -0.6491744 0.0206285 -0.147278 -0.0020486 0.028783 0.001586 -0.1891423 0.0050493 -0.0193471 0.0246652 0.0178266 0.0572358 0.0606341 -0.0704903 -0.0061697 0.1632505 -0.0033142 0.1200356 -1.2232858 0.196309 0.1871511 0.1431666 -0.3573602 -0.0274609 0.2563164 -0.059421 -0.3952803 -0.6419479 -0.1113117 0.05737 -0.1672886 -1.1340774 -0.071478 0.0566025 -0.1569313 -0.3426377 -0.8214259 -0.1568149 0.5126612 -0.2229928 -0.4855953 0.2003353 0.5599957 0.184813 -0.9024756 -0.8481572 0.0194231 -0.2389772 -0.073596 -0.3206166 0.1117931 0.0299299 0.1398104 -0.8206781 0.5078083 0.0872565 0.1432438 -0.2474879 0.2372628 0.0595348 0.0312084 0.0976523 -0.1131197 -0.271532 0.2201175 0.0381464 0.3950342 -0.5490307 -0.0961874 0.0001649 -0.1286137 -0.0064032 -0.4220758 0.3008631 0.0380931 0.1803471 -0.3157315 -0.0461853 0.0008334 -0.0140208 -0.0343825 -0.2960592 -0.2104492 -0.1155781 0.0872591 0.0184058 0.0432906 -0.0796876 0.0294606 -0.0505366 0.0503407 -0.6163657 -0.1944994 -0.4290461 1.0182883 0.2901817 -0.0736525 0.214476 -0.0243818 1.1540529 0.1607697 0.3729587 -0.106269 -0.3911483 -0.1158342 0.3071688 -0.0715946 -0.0389436 -0.3802748 -0.0502288 -0.1874555 -0.1210595 0.0710096 -0.0228962 -0.5999121 -0.0553036 0.0372004 1.5324333 -0.2493772 -0.3267131 -0.1691906 1.7256416 0.1988477 -0.3150411 0.2911636 0.3019976 1.6564134 0.1914737 -0.1706822 0.297041 0.3214353 -0.3400419 -0.1308886 -0.3293802 1.3634278 0.0729504 -0.0363844 -0.03913 -0.014548 0.046063 -0.0273605 -0.049944 -0.032193 0.1196139 0.073522 -0.0011133 -0.0190915 -0.0472988 0.0868181 -0.0415047 -0.0122217 -0.0367359 0.1365296 0.0372967 0.01957 0.0271383 0.0241312 0.0093973 0.0728734 0.0837874 0.0730376 0.0085914 0.113485 0.0256957 0.035634 0.0976502 0.1188068 -0.0446001 0.0476783 -0.0398393 0.0066339 0.3251169 -0.0822292 -0.0032541 -0.036572 0.1218282 -0.0289371 -0.0170602 0.0114026 0.3780712 0.145082 -0.0062806 -0.0847004 0.0031506 0.3848262 0.0214723 -0.140048 0.0136907 0.2822886 unknown
polarizability: 241.7317354|-26.6816792|169.4932211|8.7433991|20.5305069|95.5537796 unknown
InChI: InChI=1S/C9H6Br2O4S/c10-5-1-4(9(14)15)7(2-6(5)11)16-3-8(12)13/h1-2,12,14H,3H2
charge 0 multiplicity 1
22 atoms
Br -3.137667 3.301007 0.797016
Br -4.850037 0.584447 -0.601569
S  1.527757 0.216346 1.196257
O  1.028058 -2.21403 -0.608667
O  -1.028162 -3.250773 -0.394991
O  4.591024 1.028221 -1.329534
O  4.522356 0.413638 0.914136
C  -0.201934 0.25702 0.540901
C  -0.897922 -0.845689 -0.040239
C  -0.908571 1.459364 0.777314
C  -2.27677 -0.706748 -0.350715
C  -2.27476 1.594636 0.443663
C  -2.966321 0.498189 -0.123999
C  2.446901 0.486306 -0.437266
C  -0.342224 -2.202941 -0.337273
C  3.927761 0.625633 -0.161707
H  -0.381464 2.298715 1.237878
H  -2.80173 -1.572342 -0.765012
H  2.066915 1.391457 -0.936991
H  2.261583 -0.390566 -1.078804
H  1.317118 -3.155604 -0.757017
H  5.567489 1.098315 -1.146884
