program: Gaussian 09
title: 000236845
version: EM64L-G09RevD.01
frameworkgroup: C1[X(C20H18Br2N4O4)]
method: RPBEPBE
basis: SDD
operation: Freq
keyword: #p
keyword: freq=noraman
keyword: PBEPBE/SDD
title: #p freq=noraman PBEPBE/SDD
converged: YES YES NO NO
title: Mulliken charges:
elementType: Br Br O O O O N N N N C C C C C C C C C C C C C C C C C C C C H H H H H H H H H H H H H H H H H H
charge: 0.025692 0.026697 -0.274438 -0.276828 -0.206652 -0.204328 -0.106624 -0.101108 -0.492332 -0.489105 -0.469879 -0.432837 -0.434434 -0.475852 0.300294 0.301090 0.195050 0.193384 0.266456 0.266918 -0.362918 -0.366949 -0.342828 -0.343364 -0.203305 -0.202627 -0.186625 -0.186065 -0.204891 -0.204989 0.242739 0.265041 0.300874 0.239506 0.301729 0.238438 0.243880 0.262835 0.356995 0.353791 0.293179 0.296292 0.278297 0.278025 0.263985 0.264223 0.256663 0.256906
chargesum: 0.00000
title: Mulliken charges with hydrogens summed into heavy atoms:
elementType: Br Br O O O O N N N N C C C C C C C C C C C C C C C C C C C C
charge: 0.025692 0.026697 -0.274438 -0.276828 -0.206652 -0.204328 -0.106624 -0.101108 -0.135338 -0.135314 0.037901 0.107543 0.105733 0.030863 0.300294 0.301090 0.195050 0.193384 0.266456 0.266918 -0.069740 -0.070657 -0.064530 -0.065338 0.060681 0.061596 0.070038 0.070841 -0.204891 -0.204989
polarizability: 2.97560938e+02 8.32627994e-01 3.45593691e+02 4.14572782e+01 4.35172440e-01 2.54032807e+02
1716.lowfreq: -8.6751 -2.5061 -0.0006 0.0002 0.0006 5.0486 7.6361 11.1912 21.2669
frequency: 6.2343 9.2595 21.2152 32.6122 48.6086 49.2141 63.5141 67.5258 77.3185 88.0872 88.6257 99.7002 112.3053 116.8150 127.8031 183.0485 185.6886 199.7350 201.4818 243.4010 244.3250 275.7646 276.9048 308.0209 313.1593 345.9444 359.4075 393.4234 397.5045 410.0575 410.4976 433.9631 435.6060 460.1761 460.6824 486.2726 514.3901 517.5684 528.9794 535.8456 570.6916 575.6696 619.2079 619.8359 637.1199 638.9544 670.5551 676.1683 683.4101 707.4925 722.6345 730.0865 752.1516 753.0763 778.5716 807.2902 817.6135 849.4227 849.6425 854.5296 854.9990 860.1556 884.9932 892.8375 915.5121 923.2933 975.2396 983.1342 984.3311 989.2615 995.2829 996.3511 998.1620 1006.1021 1037.3823 1058.1264 1060.7731 1080.6844 1101.4343 1118.7717 1119.9216 1129.1429 1151.0371 1192.7106 1197.5569 1201.0308 1201.3616 1208.3352 1235.1884 1242.2123 1256.3002 1262.1077 1305.4843 1306.7119 1320.0150 1322.3439 1325.7367 1347.7011 1366.1463 1366.6188 1378.6736 1392.1973 1393.0841 1397.2423 1426.8971 1442.8767 1465.2093 1467.7848 1474.0751 1474.7737 1506.3534 1511.5371 1568.0982 1568.5310 1588.5926 1590.1453 1591.7474 1594.7371 1634.7745 1638.5466 3021.3485 3023.6577 3037.7113 3039.7513 3102.8619 3104.5222 3106.7902 3109.2157 3125.0748 3127.6293 3154.6520 3154.6749 3173.2225 3173.2706 3176.6688 3176.7513 3487.9738 3502.8583
redmass: 12.3686 10.9916 9.6718 8.9408 5.2207 6.2371 4.4984 5.6710 8.1035 7.2497 6.3400 6.4857 12.1497 7.1120 4.0672 11.0627 9.8472 8.4658 7.4368 7.3036 6.8470 7.5354 7.7304 3.5200 5.2109 3.7961 2.7427 3.0982 4.3820 2.9292 2.9481 5.1629 5.1679 4.6525 4.6204 6.6093 4.8904 4.3456 5.7985 2.0422 1.7936 1.4228 6.7482 6.6459 5.5367 5.7009 6.3173 5.4518 5.6897 7.4894 6.0547 5.3283 4.3056 4.0328 5.8059 1.3370 1.4061 1.2861 1.2945 1.5704 1.5563 4.7594 3.9583 3.7299 5.4135 5.4582 3.2494 1.4125 1.4684 3.6687 4.2591 1.3959 1.5073 3.0341 1.9828 3.2224 2.6887 2.6861 2.5884 1.4098 1.4381 2.6897 2.5267 2.7034 1.4702 1.1652 1.1856 1.9640 1.8997 1.6313 2.0011 2.2919 1.2971 1.3081 1.2416 1.2478 1.2309 1.3317 4.9792 5.4741 2.5275 2.9112 3.2943 2.6220 2.0759 2.2060 1.1105 1.1179 2.1385 2.1660 1.1105 1.1112 6.7390 7.1131 4.8109 5.5405 5.5077 4.1030 8.7274 9.6057 1.0670 1.0666 1.0645 1.0647 1.0983 1.0978 1.0937 1.0935 1.1015 1.1026 1.0889 1.0889 1.0945 1.0945 1.0969 1.0969 1.0769 1.0767
irintensity: 6.0637 8.3742 0.1710 0.9381 2.6026 0.0655 0.3880 10.7209 5.3969 1.5203 1.8104 14.8741 2.0526 3.6154 0.8466 0.0016 0.3277 1.0262 3.6032 0.4710 2.9069 0.0579 0.0129 7.5130 11.0861 2.0391 0.2544 3.1185 27.8879 0.4813 0.1905 31.4399 7.1715 11.9310 11.6024 0.6159 5.1419 7.5820 14.4059 149.2056 101.8824 73.3059 1.3265 2.0310 14.5382 11.7565 0.6488 11.4572 22.5645 29.1937 21.4069 51.3020 26.7624 28.5488 59.7871 3.3609 54.9561 8.5523 0.9650 35.9454 19.3564 16.2405 1.1822 22.2951 6.1555 3.6332 49.7330 2.7300 20.1112 74.5738 39.7637 0.9847 2.7933 0.0600 16.5824 36.0293 42.8357 37.8342 60.5679 19.1297 21.5828 7.8832 74.6450 124.2884 99.7164 26.6427 1.3437 564.5474 112.6507 89.4774 28.2033 2.8864 12.0510 10.8367 1.1281 5.2723 6.8447 5.3162 0.6306 0.1148 16.8751 3.5694 6.0264 22.4739 680.6897 821.0246 25.4182 23.0786 2.5599 49.0777 46.8603 8.9964 29.3949 25.4199 380.8759 243.1064 169.0780 17.4092 32.7212 439.4432 30.0933 21.8995 28.9812 104.7015 7.4833 6.6444 18.0932 17.8128 6.4448 4.7418 0.0323 0.1045 0.9881 1.0810 4.7900 4.6561 22.2909 17.1641
temp: 298.150 k
press: 1.00000 atm
elementType: 35 35 8 8 8 8 7 7 7 7 6 6 6 6 6 6 6 6 6 6 6 6 6 6 6 6 6 6 6 6 1 1 1 1 1 1 1 1 1 1 1 1 1 1 1 1 1 1
symmnumber: 1
zpe: 933827.8 jmol-1
zpe.correction: 0.355676 hartree
zpe.thermalcorrener: 0.383025 hartree
zpe.thermalcorrenthalpy: 0.383969 hartree
zpe.thermalcorrgfe: 0.291566 hartree
zpe.sumelectzpe: -1317.637427 hartree
zpe.sumelectthermal: -1317.610078 hartree
zpe.sumelectthermalent: -1317.609134 hartree
zpe.sumelectthermalfe: -1317.701538 hartree
dipole: 0.2471 7.8992 -0.1510
dipole: 7.9045
quadrupole: -191.4926 -147.8903 -215.9111
quadrupole: 0.5193 -9.0160 -0.2145
quadrupole: -6.3946 37.2077 -30.8131 0.5193 -9.0160 -0.2145
hfenergy: -1317.9931033 hartree
pointgroup: C01 [X(C20H18Br2N4O4)]
dipole: -0.0936185 -0.0473187 3.108114 debye
polarizability: 265.188067|-45.5985615|286.389216|-0.5325491|0.4787848|345.6101542 unknown
InChI: InChI=1S/C20H18Br2N4O4/c21-15-5-1-13(2-6-15)17(27)23-19(29)25-9-11-26(12-10-25)20(30)24-18(28)14-3-7-16(22)8-4-14/h1-8,23-24H,9-12H2
charge 0 multiplicity 1
48 atoms
Br 4.859718 -2.527655 -4.443517
Br -4.872587 2.59554 -4.37893
O  -0.318142 2.146429 1.129288
O  0.338767 -2.134742 1.1144
O  2.09629 2.611724 -0.580651
O  -2.015208 -2.602427 -0.663423
N  0.599644 1.086095 2.990377
N  -0.621418 -1.136755 2.988688
N  1.608891 0.807029 0.838452
N  -1.614897 -0.835721 0.831004
C  1.465413 0.063091 3.611078
C  -0.676006 1.251088 3.716751
C  0.653237 -1.300915 3.718674
C  -1.487067 -0.114665 3.612065
C  0.587311 1.409755 1.625427
C  -0.588622 -1.429045 1.616989
C  2.129018 1.374188 -0.355293
C  -2.093699 -1.376342 -0.393251
C  2.764484 0.387772 -1.295571
C  -2.74354 -0.375497 -1.307418
C  2.440269 -0.996008 -1.31183
C  -2.445652 1.014018 -1.278197
C  3.697942 0.896948 -2.235279
C  -3.65957 -0.8735 -2.269963
C  3.0564 -1.858927 -2.244923
C  -3.071818 1.89354 -2.188872
C  4.323419 0.044244 -3.165062
C  -4.29508 -0.004175 -3.177314
C  3.9960 -1.329792 -3.153854
C  -3.994867 1.37503 -3.120634
H  1.753125 0.41429 4.618515
H  2.392114 -0.054866 3.030348
H  -1.229865 2.08806 3.26824
H  -0.45034 1.4914 4.769879
H  1.208627 -2.138529 3.273726
H  0.423312 -1.538436 4.771392
H  -1.770388 -0.466682 4.620227
H  -2.417628 0.001806 3.03688
H  1.827437 -0.177993 1.018121
H  -1.883368 0.129214 1.044137
H  1.681601 -1.423448 -0.642781
H  -1.697294 1.433494 -0.592478
H  3.914935 1.969988 -2.227736
H  -3.855414 -1.950247 -2.298377
H  2.794595 -2.920222 -2.26606
H  -2.829589 2.959607 -2.175924
H  5.046716 0.438286 -3.884111
H  -5.005301 -0.389345 -3.914008
