program: Gaussian 09
title: 000242014
version: EM64L-G09RevD.01
frameworkgroup: C1[X(C18H18N2O7)]
method: RPBEPBE
basis: SDD
operation: Freq
keyword: #p
keyword: freq=noraman
keyword: PBEPBE/SDD
title: #p freq=noraman PBEPBE/SDD
converged: YES YES NO NO
title: Mulliken charges:
elementType: O O O O O O O N N C C C C C C C C C C C C C C C C C C H H H H H H H H H H H H H H H H H H
charge: -0.452964 -0.230892 -0.222724 -0.289206 -0.238933 -0.445997 -0.402490 -0.430871 -0.384608 0.063932 -0.319211 0.521787 0.137119 0.499485 0.152440 -0.522403 -0.409264 -0.547952 -0.432917 0.208663 -0.366988 0.160228 0.218388 -0.353565 0.144844 -0.520743 -0.542581 0.259726 0.349113 0.346996 0.290855 0.253191 0.371380 0.269186 0.291262 0.221257 0.222439 0.363338 0.355513 0.216342 0.232819 0.262508 0.225219 0.247082 0.229200
chargesum: 0.00000
title: Mulliken charges with hydrogens summed into heavy atoms:
elementType: O O O O O O O N N C C C C C C C C C C C C C C C C C C
charge: -0.081585 -0.230892 -0.222724 -0.289206 -0.238933 -0.082659 -0.046976 -0.081759 -0.037612 0.063932 -0.059485 0.521787 0.137119 0.499485 0.152440 -0.231548 -0.156074 -0.278765 -0.141655 0.208663 -0.145732 0.160228 0.218388 -0.131126 0.144844 0.190926 0.158920
polarizability: 2.63095201e+02 -2.88593095e+01 2.63790845e+02 -3.19687080e+01 -1.14824555e+01 1.80099946e+02
1716.lowfreq: -9.3502 -0.0007 0.0004 0.0008 2.0603 4.6960 16.9768 29.0408 32.7638
frequency: 16.9391 29.0195 32.7534 45.6868 58.0879 59.2546 78.1940 102.7668 106.5575 124.9966 133.3982 141.1264 150.4382 166.2359 178.0872 207.8575 211.6670 232.7050 260.2119 262.5279 275.4759 283.5294 302.3099 324.8370 332.9253 340.8860 345.9941 360.3085 367.3915 369.6674 388.1763 424.4023 445.3468 455.6381 467.1884 481.4104 501.8940 529.0031 554.2282 569.6410 584.6229 607.7001 612.4512 619.1361 633.2552 641.9664 672.7895 679.5746 719.7556 721.9906 728.9720 733.0972 746.8198 771.9274 785.7605 800.1982 815.5791 836.5902 874.7397 891.4453 902.6057 927.4458 933.0765 938.1546 963.8154 987.8834 989.1051 1001.3273 1029.9308 1073.1424 1086.9585 1107.1918 1110.7093 1113.5699 1146.6190 1152.2511 1153.2588 1165.0290 1165.6993 1167.6630 1190.3166 1215.8188 1226.9166 1238.5515 1265.0829 1267.9213 1281.3944 1290.2387 1303.0743 1306.9338 1321.2822 1366.4358 1373.2385 1392.5689 1396.1928 1410.4287 1412.5886 1437.6471 1444.9973 1456.6329 1468.1319 1472.2376 1479.7984 1498.9533 1513.5761 1592.0048 1603.5179 1610.9777 1613.5605 1665.6843 1723.6481 2958.7988 2981.4174 3001.8116 3046.6762 3090.4329 3111.8164 3115.9116 3128.4005 3131.8198 3157.4843 3159.0367 3170.7683 3174.7389 3558.1184 3567.8980 3572.4216 3577.0343 3584.0161
redmass: 6.0739 4.4359 5.0836 7.0293 4.7626 3.1580 4.6119 4.0973 4.7594 2.2958 4.1343 4.4277 3.4131 6.7311 4.3568 2.5696 3.3464 4.3004 5.9327 5.8848 2.3819 3.4068 4.8335 5.0076 4.5533 1.9480 1.2697 1.6368 2.2964 1.5877 5.2783 6.0040 4.7644 3.3450 3.4246 4.5692 1.3407 4.6505 4.9476 4.7594 5.1848 4.6461 9.6573 5.9043 3.2440 2.3303 2.8190 5.1019 4.9095 5.3764 4.7197 4.4405 5.4609 4.6210 2.6925 1.4719 1.7885 5.4952 1.5604 2.1355 2.4936 2.3993 2.2067 1.3309 3.5359 5.3696 6.9224 4.6695 4.3345 2.5094 2.1702 2.5066 1.2649 1.2411 1.5329 1.3794 1.3608 1.4896 1.2042 1.6117 1.4112 3.7356 2.3643 2.2185 3.8772 2.6237 1.5241 1.5916 1.5849 1.6507 4.4790 1.6734 1.6620 6.1770 3.0931 6.5476 2.0931 1.2841 1.3957 1.0631 1.0492 1.0693 1.0562 2.9237 3.0921 6.6484 6.3644 6.8512 6.8341 8.8687 9.2552 1.0333 1.0337 1.0851 1.1038 1.0986 1.0899 1.0900 1.0993 1.1048 1.0915 1.0905 1.0934 1.0939 1.0662 1.0793 1.0660 1.0660 1.0805
irintensity: 0.0841 0.4004 0.7474 0.6479 2.0768 3.6326 0.4903 5.9859 4.3464 2.4162 5.5575 0.1595 0.7364 3.7285 1.3496 2.8821 5.6238 15.4803 2.0274 3.3827 3.2098 8.7700 12.8154 7.2552 2.6364 58.1919 74.8713 60.9334 109.8578 89.3956 47.6173 4.8480 8.9781 0.2900 6.1596 9.8712 76.9727 7.4998 2.4166 28.4031 11.2061 3.1897 22.0649 16.7293 49.7307 35.8926 53.4827 74.8393 24.5122 33.9735 5.0358 4.4434 48.4257 4.8224 45.2425 22.9534 22.4056 19.0365 16.0308 20.2230 3.8814 18.3088 33.6603 2.2650 18.8079 50.5482 69.9834 24.2323 44.1483 85.5135 242.2043 29.8076 0.1455 7.0348 25.4586 14.7075 23.3656 1.4984 34.5225 61.8235 71.5139 130.2137 141.4695 21.6707 194.3878 81.8559 108.9520 125.5677 24.7663 34.9840 130.0336 8.7287 30.5729 10.7118 30.9654 7.5719 17.3220 8.2304 6.8608 16.5426 12.7041 39.9898 32.1318 135.7518 109.2520 30.9148 46.3330 4.2065 12.1492 396.1154 566.1446 43.8323 85.5918 15.6730 41.1537 31.7268 15.5345 20.8866 23.1801 14.5346 0.5560 3.7345 2.7803 0.3790 21.3878 79.6180 41.5968 44.9573 74.7478
temp: 298.150 k
press: 1.00000 atm
elementType: 8 8 8 8 8 8 8 7 7 6 6 6 6 6 6 6 6 6 6 6 6 6 6 6 6 6 6 1 1 1 1 1 1 1 1 1 1 1 1 1 1 1 1 1 1
symmnumber: 1
zpe: 886681.2 jmol-1
zpe.correction: 0.337719 hartree
zpe.thermalcorrener: 0.363642 hartree
zpe.thermalcorrenthalpy: 0.364586 hartree
zpe.thermalcorrgfe: 0.280968 hartree
zpe.sumelectzpe: -1330.805168 hartree
zpe.sumelectthermal: -1330.779245 hartree
zpe.sumelectthermalent: -1330.778301 hartree
zpe.sumelectthermalfe: -1330.861919 hartree
dipole: 2.2931 -2.4942 1.6364
dipole: 3.7626
quadrupole: -137.7589 -165.4224 -156.5418
quadrupole: -5.3995 7.3560 -12.4434
quadrupole: 15.4821 -12.1814 -3.3007 -5.3995 7.3560 -12.4434
hfenergy: -1331.1428874 hartree
pointgroup: C01 [X(C18H18N2O7)]
dipole: 0.0156397 -1.3678486 0.5657956 debye
polarizability: 226.5721782|4.4789384|290.203058|-36.0299943|20.551808|190.2107558 unknown
InChI: InChI=1S/C18H18N2O7/c1-26-13-7-9(3-5-11(13)21)15(23)18(16(24)19-17(25)20-18)10-4-6-12(22)14(8-10)27-2/h3-8,15,19-23H,1-2H3
charge 0 multiplicity 1
45 atoms
O  0.069641 2.784646 -1.856246
O  2.905149 1.260562 -1.93338
O  2.163947 3.757029 1.98558
O  1.57307 -3.539477 -1.740866
O  -4.051363 -1.241348 0.277374
O  1.060278 -4.529167 0.91899
O  -5.260448 0.960242 1.209476
N  0.924318 2.009435 0.938514
N  2.912614 2.555784 0.055119
C  1.046117 1.140462 -0.23924
C  -0.102417 1.438551 -1.306599
C  1.101248 -0.355822 0.107829
C  2.404855 1.62166 -0.837579
C  -1.480483 1.349923 -0.673437
C  1.99364 2.874643 1.114682
C  1.370991 -1.304859 -0.909385
C  0.868997 -0.811866 1.424757
C  -2.108695 0.085197 -0.53688
C  -2.126581 2.504841 -0.182382
C  1.379348 -2.690544 -0.64195
C  0.873444 -2.194044 1.706206
C  1.105536 -3.140811 0.684266
C  -3.365075 -0.038102 0.094732
C  -3.389525 2.390089 0.444094
C  -4.012706 1.13383 0.59437
C  2.544421 -4.647988 -1.604987
C  -3.41176 -2.458366 -0.232553
H  0.011338 0.676054 -2.102063
H  0.034505 2.164549 1.413396
H  3.791875 3.059499 -0.06543
H  1.616927 -0.990629 -1.928841
H  0.692082 -0.095428 2.231146
H  0.804982 2.767633 -2.52102
H  -1.608366 -0.805665 -0.927538
H  -1.66258 3.4834 -0.331083
H  0.679077 -2.540563 2.730203
H  -3.897799 3.290341 0.81413
H  0.852531 -4.712571 1.868901
H  -5.623008 1.835141 1.497992
H  3.546753 -4.249257 -1.357762
H  2.565612 -5.122028 -2.597699
H  2.221311 -5.366467 -0.835035
H  -3.277805 -2.413304 -1.330841
H  -4.106302 -3.271392 0.023539
H  -2.430894 -2.633611 0.2518
