program: Gaussian 09
title: 000236838
version: EM64L-G09RevD.01
frameworkgroup: C1[X(C8H11N5O3)]
method: RPBEPBE
basis: SDD
operation: Freq
keyword: #p
keyword: freq=noraman
keyword: PBEPBE/SDD
title: #p freq=noraman PBEPBE/SDD
converged: NO YES NO NO
title: Mulliken charges:
elementType: O O O N N N N N C C C C C C C C H H H H H H H H H H H
charge: -0.242225 -0.234296 -0.271732 -0.116575 -0.115428 0.023756 -0.073520 -0.601202 -0.374119 -0.383460 -0.298946 -0.309474 0.270168 0.063416 0.165777 -0.357951 0.231391 0.278982 0.246447 0.238950 0.205168 0.227033 0.222293 0.245864 0.248386 0.338054 0.373243
chargesum: 0.00000
title: Mulliken charges with hydrogens summed into heavy atoms:
elementType: O O O N N N N N C C C C C C C C
charge: -0.242225 -0.234296 -0.271732 -0.116575 -0.115428 0.023756 -0.073520 0.110095 0.136255 0.101937 0.133255 0.158682 0.270168 0.063416 0.165777 -0.109564
polarizability: 2.02783762e+02 2.46373730e+00 1.52230885e+02 -2.42721344e+00 -2.72035866e+00 7.78194869e+01
1716.lowfreq: -7.1060 -2.7652 0.0005 0.0006 0.0010 13.9681 65.1509 71.5578 84.1886
frequency: 64.8703 71.5169 84.1739 105.1072 161.3586 185.4320 217.2869 243.7341 275.6078 308.4638 333.3759 377.0474 386.7123 416.5681 447.6617 453.9412 484.1786 513.6034 552.2725 554.5903 599.6052 621.7483 675.9409 681.4552 721.1525 733.0424 780.2721 785.8317 803.8774 829.6271 883.0124 905.6155 952.5180 970.6732 992.6616 1014.4139 1045.1282 1055.2819 1067.5857 1101.4277 1119.2758 1155.5290 1188.4408 1190.5925 1218.7259 1255.0941 1271.2071 1295.1004 1301.8364 1318.6754 1322.1142 1339.2764 1344.8435 1361.0557 1370.1723 1440.4659 1449.0180 1457.5050 1459.7262 1467.8260 1483.4850 1500.4374 1541.7466 1582.7111 2962.1155 2980.8710 2996.6686 3011.0191 3088.5584 3104.5511 3109.7599 3146.4581 3159.2147 3420.4459 3632.7670
redmass: 4.8196 4.5177 7.2553 7.0798 4.1823 6.8867 6.1318 5.9013 3.7276 2.9852 4.5430 3.2752 5.1273 3.7130 2.4697 3.0016 4.1083 5.3425 4.6368 4.2665 1.3687 2.3474 5.1787 8.2139 3.6760 1.3813 7.8733 5.3029 4.9543 1.7306 4.7180 2.4786 1.4555 2.8367 3.0605 2.3975 2.5110 3.5402 3.1597 2.3036 3.0834 4.4877 2.8232 1.3449 1.8495 1.6948 1.2851 5.8425 2.6003 2.4255 1.4367 1.2892 1.3323 1.3386 1.4659 3.2959 1.1004 1.0937 1.1054 1.1695 4.8610 2.0064 5.1331 2.4907 1.0676 1.0713 1.0665 1.0615 1.0973 1.1041 1.0957 1.0910 1.0923 1.0511 1.0992
irintensity: 0.1160 1.6581 1.1735 4.0613 2.6055 1.6463 2.1301 5.9163 6.3345 18.8258 1.1819 6.9447 9.1834 2.0830 0.1118 3.1144 10.5588 8.9046 3.1057 10.8262 130.5116 22.8767 25.0152 1.0092 17.0706 74.3744 48.0293 15.4990 10.2508 3.7318 20.6239 15.7941 10.9855 20.8930 33.8209 39.1962 36.0521 7.7571 14.5928 7.2285 20.1815 64.0788 170.9622 74.0469 37.5274 14.6337 15.0584 74.1899 19.0465 45.0561 6.8049 12.7701 25.1344 38.5919 74.0022 103.4959 2.2705 24.1316 10.7407 56.4708 124.4423 48.9973 487.9880 560.2758 49.8273 29.0726 50.0290 29.1659 34.7366 27.9444 6.5976 6.9420 21.8853 78.5318 104.9524
temp: 298.150 k
press: 1.00000 atm
elementType: 8 8 8 7 7 7 7 7 6 6 6 6 6 6 6 6 1 1 1 1 1 1 1 1 1 1 1
symmnumber: 1
zpe: 541344.1 jmol-1
zpe.correction: 0.206187 hartree
zpe.thermalcorrener: 0.219582 hartree
zpe.thermalcorrenthalpy: 0.220526 hartree
zpe.thermalcorrgfe: 0.166271 hartree
zpe.sumelectzpe: -809.590239 hartree
zpe.sumelectthermal: -809.576844 hartree
zpe.sumelectthermalent: -809.575899 hartree
zpe.sumelectthermalfe: -809.630155 hartree
dipole: -0.4502 1.8215 1.4081
dipole: 2.3459
quadrupole: -90.3346 -99.9865 -92.2108
quadrupole: 4.8987 -0.6572 -5.2503
quadrupole: 3.8427 -5.8092 1.9665 4.8987 -0.6572 -5.2503
hfenergy: -809.7964259 hartree
pointgroup: C01 [X(C8H11N5O3)]
dipole: 0.2346064 -0.8604437 0.237527 debye
polarizability: 202.0506235|5.1407587|139.4642401|4.5889197|28.992961|91.3192711 unknown
InChI: InChI=1S/C8H11N5O3/c9-7-6(13(14)15)8(11-5-10-7)12-1-3-16-4-2-12/h5H,1-4,9H2
charge 0 multiplicity 1
27 atoms
O  -3.953501 0.062914 0.066059
O  -0.266891 2.262042 -0.054802
O  1.73126 2.554001 1.005402
N  -1.138109 -0.566114 0.109216
N  0.610367 -1.710562 -0.921746
N  0.855963 1.781303 0.395161
N  2.945263 -1.195726 -0.489661
N  3.589836 0.74622 0.611725
C  -2.105101 -1.501867 -0.523561
C  -1.76003 0.226457 1.19586
C  -3.323778 -0.69868 -1.024563
C  -2.978177 1.001447 0.651747
C  0.194865 -0.600628 -0.213357
C  1.180598 0.397957 0.174699
C  2.574601 -0.015731 0.121964
C  1.940707 -1.919424 -1.046138
H  -2.431165 -2.245686 0.229783
H  -1.595845 -2.033314 -1.340771
H  -1.040095 0.903163 1.670921
H  -2.114255 -0.49703 1.958981
H  -3.009956 -0.009268 -1.837311
H  -4.104019 -1.380779 -1.399616
H  -3.512969 1.51067 1.468918
H  -2.645761 1.740145 -0.101877
H  2.242576 -2.787242 -1.640982
H  4.541003 0.412796 0.45804
H  3.360714 1.641534 1.057712
