program: Gaussian 09
title: 000241982
version: EM64L-G09RevD.01
frameworkgroup: C1[X(C18H14N6)]
method: RPBEPBE
basis: SDD
operation: Freq
keyword: #pfreq=noraman
keyword: PBEPBE/SDD
title: #p freq=noraman PBEPBE/SDD
converged: YES YES NO NO
title: Mulliken charges:
elementType: N N N N N N C C C C C C C C C C C C C C C C C C H H H H H H H H H H H H H H
charge: -0.031928 0.002546 -0.011555 -0.062311 -0.633048 -0.614318 -0.148468 -0.020978 -0.044917 0.311968 0.053140 -0.124872 0.108257 0.305542 -0.380711 -0.425524 -0.357724 -0.354255 -0.226942 -0.229355 -0.234749 -0.231985 -0.232226 -0.233677 0.255540 0.276293 0.285773 0.272067 0.231115 0.232062 0.234341 0.335743 0.344926 0.225233 0.223340 0.327821 0.348034 0.225799
chargesum: 0.00000
title: Mulliken charges with hydrogens summed into heavy atoms:
elementType: N N N N N N C C C C C C C C C C C C C C C C C C
charge: -0.031928 0.002546 -0.011555 -0.062311 0.047622 0.061537 -0.148468 -0.020978 -0.044917 0.311968 0.053140 -0.124872 0.108257 0.305542 -0.125171 -0.149231 -0.071952 -0.082188 0.004173 0.002708 -0.000408 -0.006752 -0.008886 -0.007878
polarizability: 5.23938044e+02 -8.47795002e+00 2.42194003e+02 1.11947443e+00 -7.83974155e+00 1.04495188e+02
1716.lowfreq: -4.9011 -4.0826 -0.0008 -0.0008 0.0003 6.2078 22.7323 42.0325 55.1862
frequency: 22.6988 42.0224 55.1697 66.1284 75.1053 103.9144 126.0019 149.6217 201.3679 215.4955 224.8634 241.2655 282.5314 287.4545 316.4743 336.4237 397.9340 402.4031 406.9435 434.2483 458.1199 474.3692 478.5726 486.9933 515.7446 542.8409 546.2619 584.6616 593.3434 611.2773 613.0472 616.1670 617.4146 665.0155 669.6465 673.3417 692.1797 707.0534 708.7845 740.9060 753.3090 777.5468 797.6417 801.7504 827.5535 861.6781 867.0423 879.2704 934.5298 957.4915 984.3584 985.0816 989.3118 991.7048 999.7668 1001.5622 1005.5043 1011.0349 1025.1498 1035.9083 1049.6199 1075.2334 1083.5951 1118.6874 1169.1683 1169.7995 1174.3215 1178.8466 1191.3332 1227.8675 1272.0509 1295.4339 1307.7141 1319.3747 1341.1377 1360.6008 1376.3946 1390.3240 1398.2560 1418.1873 1432.0841 1439.7728 1452.8109 1483.4172 1486.7028 1510.2286 1531.5869 1535.3647 1582.6010 1587.3024 1604.7042 1608.1556 1611.3931 1613.1726 3123.1631 3124.9989 3132.5811 3136.7890 3145.0430 3152.9207 3156.5922 3167.6432 3168.8444 3173.8425 3525.9004 3529.7179 3685.6804 3687.2660
redmass: 5.9983 3.8074 4.4643 5.0383 5.9333 5.2862 5.5003 6.0955 5.7739 6.3822 4.8393 5.0926 6.0662 5.1687 4.1698 5.8683 4.0915 2.6610 2.8821 4.9786 4.1122 1.2476 3.1507 4.1581 3.1663 2.4662 2.2867 1.5034 7.8211 3.9638 1.3367 4.8085 4.1915 7.8852 6.6149 7.7817 4.5109 1.9500 1.6664 3.2859 5.4839 3.2165 3.7167 3.5120 7.4240 1.2564 1.2451 5.9621 1.4024 1.4363 2.0246 3.0856 4.3062 4.4376 1.5079 1.3636 2.4856 1.3324 1.9960 1.9299 2.4393 1.5609 1.6163 4.0145 1.9101 1.0728 1.0569 1.4593 1.1163 4.1975 6.7274 3.4281 1.5457 1.4662 8.4171 5.2489 6.5720 8.5030 6.4500 5.4664 2.5760 2.5341 3.9278 2.6696 2.6739 3.9327 3.6360 4.8033 5.9084 6.4230 2.1347 1.9456 2.8392 4.3094 1.0851 1.0858 1.0875 1.0897 1.0927 1.0950 1.0956 1.0946 1.1012 1.0980 1.0442 1.0447 1.1049 1.1051
irintensity: 0.0587 0.2699 0.7417 1.8489 3.2482 2.0121 1.5443 0.0302 0.7935 1.3082 4.6137 3.0268 1.7123 2.6171 3.4246 1.0308 1.1701 7.2081 0.0327 2.0907 13.4583 109.8052 48.9920 16.8252 4.1113 87.1272 123.8896 79.5377 0.4688 9.8708 33.9317 8.7224 16.5839 3.5681 19.1619 16.5585 1.0828 69.0681 42.7579 42.3332 17.9516 8.9307 12.1078 26.1957 1.1209 1.8923 0.0019 3.5021 1.2809 5.6776 0.2859 24.2033 0.2882 16.0204 1.1565 0.0660 11.2167 1.3725 20.4387 0.6827 2.6801 17.0038 6.5143 7.6010 12.8924 0.4331 0.4270 35.5772 4.2770 11.9360 39.7731 16.9094 2.4668 14.3802 93.1198 288.4723 13.4886 191.6698 61.5796 142.5937 42.7571 32.1620 132.5609 44.8013 37.1847 336.0607 439.2576 127.8472 1.5695 1.4760 418.9567 145.7980 51.0906 75.9124 0.0981 4.6263 0.7362 20.2869 16.9446 40.3250 25.0464 11.0911 29.4443 28.4017 100.5763 89.7086 54.6789 56.9527
temp: 298.150 k
press: 1.00000 atm
elementType: 7 7 7 7 7 7 6 6 6 6 6 6 6 6 6 6 6 6 6 6 6 6 6 6 1 1 1 1 1 1 1 1 1 1 1 1 1 1
symmnumber: 1
zpe: 760700.7 jmol-1
zpe.correction: 0.289736 hartree
zpe.thermalcorrener: 0.308488 hartree
zpe.thermalcorrenthalpy: 0.309432 hartree
zpe.thermalcorrgfe: 0.242002 hartree
zpe.sumelectzpe: -1021.234074 hartree
zpe.sumelectthermal: -1021.215322 hartree
zpe.sumelectthermalent: -1021.214378 hartree
zpe.sumelectthermalfe: -1021.281808 hartree
dipole: 5.3949 1.2654 -0.3038
dipole: 5.5497
quadrupole: -109.3151 -117.8646 -142.9232
quadrupole: -7.3742 -1.1589 -1.2102
quadrupole: 14.0526 5.5030 -19.5556 -7.3742 -1.1589 -1.2102
hfenergy: -1021.5238097 hartree
pointgroup: C01 [X(C18H14N6)]
dipole: -2.1247381 -0.4468852 -0.2303807 debye
polarizability: 523.860064|-8.7289265|230.2931678|-4.4258817|39.5939778|116.474004 unknown
InChI: InChI=1S/C18H14N6/c19-15-13(11-7-3-1-4-8-11)21-14-16(20)22-17(24-18(14)23-15)12-9-5-2-6-10-12/h1-10H,19-20H2
charge 0 multiplicity 1
38 atoms
N  -1.536823 -0.757609 -0.21674
N  -0.424428 1.837991 0.226646
N  1.763417 0.922257 0.134595
N  2.077072 -1.467536 -0.336774
N  -2.553286 2.758892 0.235644
N  0.230555 -2.898319 -0.637557
C  -0.179951 -0.547119 -0.192992
C  -2.3542 0.295401 -0.005286
C  0.399878 0.745106 0.066515
C  -3.820578 0.04331 0.009319
C  -1.764103 1.631142 0.167383
C  2.532722 -0.184256 -0.070514
C  0.734947 -1.651557 -0.393886
C  4.007921 -0.007549 -0.005623
C  -4.376232 -0.883844 -0.91444
C  -4.683628 0.662347 0.957269
C  4.558917 1.274704 0.263608
C  4.878539 -1.111401 -0.210883
C  -5.757535 -1.166217 -0.908716
C  -6.065568 0.371063 0.966534
C  -6.610239 -0.53621 0.028839
C  5.956414 1.446895 0.326661
C  6.276292 -0.935026 -0.147187
C  6.820501 0.343727 0.121706
H  -3.708549 -1.373243 -1.630836
H  -4.269125 1.326953 1.724123
H  3.868811 2.109602 0.417705
H  4.435988 -2.090082 -0.416901
H  -6.170614 -1.876376 -1.633601
H  -6.713525 0.843465 1.713172
H  -7.683308 -0.756355 0.034009
H  -2.075582 3.656779 0.301837
H  -3.560165 2.717572 0.10198
H  6.374801 2.438116 0.534518
H  6.942287 -1.790634 -0.306301
H  0.868026 -3.680714 -0.764725
H  -0.781657 -3.019814 -0.647002
H  7.907107 0.479737 0.170801
